program: Gaussian 09
title: 000102166
version: EM64L-G09RevD.01
frameworkgroup: C1[X(C22H32O2)]
method: RPBEPBE
basis: SDD
operation: Freq
keyword: #pfreq=noraman
keyword: PBEPBE/SDD
title: #p freq=noraman PBEPBE/SDD
converged: YES YES NO NO
title: Mulliken charges:
elementType: O O C C C C C C C C C C C C C C C C C C C C C C H H H H H H H H H H H H H H H H H H H H H H H H H H H H H H H H
charge: -0.444436 -0.238647 -0.096941 -0.202303 -0.150786 0.311211 0.266443 -0.551268 -0.527025 -0.493143 -0.671803 0.492022 0.090908 -0.518194 0.297102 -0.826310 -0.485685 -0.829743 -0.671932 -0.452183 -0.048857 0.088618 -0.855188 -0.786520 0.195516 0.251094 0.218872 0.224253 0.217939 0.195290 0.249596 0.213717 0.211320 0.228665 0.235588 0.205857 0.220932 0.215529 0.260480 0.225608 0.207472 0.224353 0.224017 0.225605 0.202552 0.227499 0.217528 0.222864 0.196886 0.237510 0.254394 0.238048 0.330074 0.236535 0.232917 0.256152
chargesum: 0.00000
title: Mulliken charges with hydrogens summed into heavy atoms:
elementType: O O C C C C C C C C C C C C C C C C C C C C C C
charge: -0.114361 -0.238647 0.098575 0.048791 0.068086 0.311211 0.266443 -0.109077 -0.082139 -0.068106 -0.207550 0.492022 0.090908 -0.091405 0.297102 -0.124694 -0.278212 -0.155767 -0.241882 -0.011791 0.148029 0.088618 -0.125236 -0.060917
polarizability: 2.92719708e+02 -5.66600046e+00 2.43140742e+02 6.96105314e+00 -3.00610832e+00 1.70760038e+02
1716.lowfreq: -8.8387 -5.8780 0.0001 0.0005 0.0006 2.8197 29.7195 47.3565 58.4844
frequency: 29.6374 47.2832 58.4747 75.5805 86.6915 105.9843 111.0764 128.5929 158.3874 173.9522 184.6849 195.0346 199.7311 223.3911 230.4547 232.2858 255.5291 261.4841 274.8050 289.1327 293.6067 297.2409 306.5353 322.4050 322.8205 345.4678 360.7334 391.2109 410.2194 419.1696 440.7160 446.2162 459.2967 475.5939 482.6548 493.7774 533.1354 546.5449 570.2068 590.7419 596.5696 624.2341 660.7290 688.4296 695.3014 724.5771 783.1542 796.6413 811.2287 832.4851 839.4236 867.0997 886.4365 904.8765 908.1695 913.9754 936.4466 944.5731 948.1013 962.0776 974.6609 985.2341 989.4049 1000.1209 1011.7367 1019.3916 1020.7556 1026.3891 1029.9308 1043.2502 1057.9721 1074.6474 1080.7750 1097.0654 1103.5717 1123.6531 1129.6778 1133.0623 1141.5271 1143.2554 1148.6120 1163.0864 1182.6176 1188.5821 1191.7476 1206.2935 1214.3550 1233.1943 1247.3653 1249.7304 1255.8638 1269.2148 1269.9749 1281.7010 1294.4776 1296.1161 1319.5731 1321.8598 1324.0279 1330.9309 1334.0129 1336.2969 1337.3696 1342.3119 1352.2500 1357.6394 1365.7290 1372.0898 1383.4924 1385.4809 1394.0463 1404.5209 1442.3498 1451.2626 1454.5454 1454.7586 1457.6030 1460.4464 1461.0939 1467.8034 1471.5924 1478.2811 1481.3265 1483.8219 1484.6023 1490.8332 1492.7435 1553.4490 1609.6740 1681.4217 2911.7217 2917.8015 2924.8859 2931.6524 2950.4180 2963.7127 2964.0575 2965.8670 2970.6839 2973.7957 2979.2870 2982.4591 2982.6296 2990.2993 2996.8085 2998.1832 3019.0414 3022.6821 3030.5336 3035.3048 3041.8875 3057.9818 3058.3789 3070.7512 3072.2467 3076.9215 3078.2226 3079.1888 3089.4135 3113.6995 3123.0976 3552.1143
redmass: 4.2181 3.3115 3.3045 4.4256 4.5891 3.5753 1.1202 2.9502 2.1569 1.3689 2.8568 2.0468 1.6687 1.2863 1.8301 2.8016 2.3907 2.7032 2.3556 2.1471 2.4925 2.0176 1.6026 2.5151 2.7467 2.6491 2.7922 3.5897 3.9409 2.5982 3.4607 3.7684 2.0621 2.8514 3.7909 2.4964 3.0100 3.3016 3.6366 2.9261 2.9846 3.7003 2.7070 3.6291 3.3350 2.9508 2.3593 2.0397 1.5733 1.8204 2.5281 2.0304 1.6808 2.4150 1.7449 1.9408 1.8406 1.8372 1.9247 1.6657 1.9213 2.1316 2.4683 2.3263 1.8029 1.8510 1.8365 2.0406 1.7925 2.2291 2.1063 2.7708 2.3818 1.8295 1.8244 1.7505 1.6294 1.8597 1.7680 1.7085 2.0942 1.9375 1.6920 2.4182 1.8777 1.5653 2.7499 1.6849 1.3603 1.5157 1.9511 1.6206 1.5615 1.3052 1.2912 1.4543 1.3319 1.5847 1.4790 1.5221 1.8093 1.6521 1.4341 1.5838 1.4321 1.5676 1.2446 1.5484 1.2079 1.2290 1.2279 1.6413 1.0891 1.1023 1.0766 1.0801 1.0782 1.0786 1.0739 1.0796 1.0821 1.0850 1.0708 1.0785 1.0596 1.0642 1.0634 6.6337 6.6899 7.7815 1.0814 1.0806 1.0659 1.0839 1.0643 1.0584 1.0631 1.0430 1.0664 1.0800 1.0391 1.0384 1.0384 1.0613 1.0886 1.0619 1.1016 1.0947 1.0942 1.0968 1.0974 1.1017 1.0988 1.0992 1.0984 1.0936 1.0966 1.0913 1.0992 1.1008 1.0942 1.0659
irintensity: 0.0294 0.3874 3.1433 1.6964 0.1956 2.5881 0.2789 0.1343 0.1759 0.4050 7.4071 0.1003 1.0211 0.0729 1.5189 0.6815 1.9987 4.9907 8.7046 2.9594 16.8298 18.4836 86.4350 4.4144 18.7054 2.1256 2.0676 1.2197 2.4765 1.5058 1.4968 2.3705 1.7132 5.5588 3.3166 3.2219 0.4723 1.7611 12.2085 1.7684 4.6437 1.9331 6.2840 1.6682 0.5211 4.5095 1.0025 2.0974 11.7472 10.1137 1.3508 2.0149 3.3640 8.0056 9.5535 1.1996 3.0966 32.1451 4.8782 2.5576 14.7925 15.9688 33.5147 24.4584 4.7386 5.8064 10.5589 35.1524 23.4697 9.1376 5.0836 3.8223 10.1478 2.1218 4.0164 8.1943 6.6049 0.7025 5.5441 2.2368 18.5826 0.6052 1.7616 4.0543 1.1065 13.1050 8.0037 11.6660 2.3921 4.8371 26.7326 3.4742 1.8115 2.5634 2.7206 1.2582 3.9276 7.5075 2.8183 3.3855 49.2277 64.3719 8.8578 19.3958 0.7088 5.9239 46.6529 15.8238 8.7865 42.2964 25.3423 2.2687 18.5797 24.5467 7.2098 10.4144 4.7046 10.6561 3.6113 25.4661 6.1680 7.0636 14.4960 16.9964 8.4364 11.3828 10.4786 115.8259 69.3577 2.6998 3.2495 19.4472 39.1473 38.2786 17.9989 25.1933 52.7420 31.2017 24.0227 14.5153 21.4315 7.5534 9.0973 40.1906 55.2928 23.8835 36.4099 29.2325 16.9070 39.6047 49.9142 22.5334 52.2232 15.0144 58.5884 14.0531 18.4013 70.1162 14.0249 23.2500 12.1142 3.1432
temp: 298.150 k
press: 1.00000 atm
elementType: 8 8 6 6 6 6 6 6 6 6 6 6 6 6 6 6 6 6 6 6 6 6 6 6 1 1 1 1 1 1 1 1 1 1 1 1 1 1 1 1 1 1 1 1 1 1 1 1 1 1 1 1 1 1 1 1
symmnumber: 1
zpe: 1282988.9 jmol-1
zpe.correction: 0.488665 hartree
zpe.thermalcorrener: 0.512621 hartree
zpe.thermalcorrenthalpy: 0.513565 hartree
zpe.thermalcorrgfe: 0.437525 hartree
zpe.sumelectzpe: -1006.117677 hartree
zpe.sumelectthermal: -1006.093721 hartree
zpe.sumelectthermalent: -1006.092777 hartree
zpe.sumelectthermalfe: -1006.168817 hartree
dipole: -1.4399 4.9216 -1.0971
dipole: 5.2439
quadrupole: -152.5418 -147.9393 -145.3688
quadrupole: -6.6652 2.6490 0.1364
quadrupole: -3.9252 0.6773 3.2479 -6.6652 2.6490 0.1364
hfenergy: -1006.6063417 hartree
pointgroup: C01 [X(C22H32O2)]
dipole: 0.5714628 1.8952331 0.5813777 debye
polarizability: 292.0818099|4.1586276|242.2910406|12.2079606|7.8036484|172.2476379 unknown
InChI: InChI=1S/C22H32O2/c1-13-11-19-17-6-5-15-12-16(24)7-9-21(15,3)18(17)8-10-22(19,4)20(13)14(2)23/h5,16-19,24H,6-12H2,1-4H3
charge 0 multiplicity 1
56 atoms
O  -6.773539 -0.090141 0.220975
O  4.296527 -2.39959 -0.067162
C  -0.950428 -0.417576 0.241269
C  -0.165618 0.843707 -0.250129
C  1.275333 0.747956 0.275837
C  2.039574 -0.526254 -0.204758
C  -2.427083 -0.450185 -0.312383
C  -0.180715 -1.752944 -0.002458
C  1.315809 -1.741673 0.42255
C  -0.865355 2.123575 0.262129
C  2.29412 1.887983 0.05493
C  -3.081282 0.938635 -0.156914
C  3.469473 -0.185038 0.28607
C  -3.25279 -1.481024 0.535051
C  3.620325 1.186938 0.371834
C  2.114651 -0.670221 -1.756322
C  -2.370224 2.066989 0.114811
C  -2.468952 -0.856483 -1.819286
C  -4.595243 1.002396 -0.333334
C  -4.775783 -1.444493 0.279458
C  -5.332826 -0.041322 0.538261
C  4.491592 -1.250001 0.445947
C  4.833878 2.037954 0.644342
C  5.770433 -1.009893 1.251811
H  -1.04039 -0.292991 1.345887
H  -0.160887 0.868509 -1.35905
H  1.194331 0.638389 1.382681
H  -0.236222 -2.023899 -1.072823
H  -0.690062 -2.569167 0.544678
H  1.391869 -1.677249 1.52786
H  1.798304 -2.686932 0.117182
H  -0.472752 3.012342 -0.273158
H  -0.604764 2.281329 1.33343
H  2.127722 2.773424 0.697557
H  2.298413 2.251867 -0.995835
H  -3.065037 -1.278085 1.610225
H  -2.877982 -2.501763 0.332871
H  2.545374 0.232918 -2.226906
H  2.764471 -1.527729 -2.002467
H  1.12566 -0.848358 -2.211887
H  -2.913536 3.017006 0.234729
H  -1.754856 -0.255796 -2.410923
H  -2.221105 -1.924538 -1.957089
H  -3.470777 -0.695697 -2.253245
H  -4.953262 2.024322 -0.095876
H  -4.881389 0.797806 -1.385926
H  -5.01257 -1.727938 -0.763909
H  -5.291285 -2.171039 0.934418
H  -5.190572 0.220174 1.611737
H  4.890126 2.858578 -0.097149
H  5.785277 1.488499 0.617903
H  4.748739 2.527504 1.635991
H  -7.16249 0.810952 0.360132
H  5.615728 -0.326651 2.103323
H  6.557012 -0.580997 0.60085
H  6.137135 -1.983883 1.61496
