program: Gaussian 09
title: 000102133
version: EM64L-G09RevD.01
frameworkgroup: C1[X(C21H30O3)]
method: RPBEPBE
basis: SDD
operation: Freq
keyword: #pfreq=noraman
keyword: PBEPBE/SDD
title: #p freq=noraman PBEPBE/SDD
converged: YES YES NO NO
title: Mulliken charges:
elementType: O O O C C C C C C C C C C C C C C C C C C C C C H H H H H H H H H H H H H H H H H H H H H H H H H H H H H H
charge: -0.190390 -0.208984 -0.201189 -0.096838 -0.126769 0.326114 -0.289672 0.353405 -0.034162 -0.205493 -0.492323 -0.560115 -0.651807 -0.512297 0.131868 -0.476705 -0.456569 -0.805722 -0.613270 -0.825863 -0.543835 0.156346 0.169997 -0.799419 0.208988 0.253010 0.218053 0.196648 0.235107 0.225888 0.209742 0.217539 0.236578 0.229722 0.246523 0.207537 0.214403 0.266495 0.212067 0.207658 0.253254 0.233521 0.233589 0.248935 0.241332 0.238697 0.270440 0.211836 0.210823 0.245426 0.229714 0.243028 0.249003 0.258136
chargesum: 0.00000
title: Mulliken charges with hydrogens summed into heavy atoms:
elementType: O O O C C C C C C C C C C C C C C C C C C C C C
charge: -0.190390 -0.208984 -0.201189 0.112150 0.126241 0.326114 -0.071619 0.353405 0.162485 0.029614 -0.056693 -0.105998 -0.175562 -0.090357 0.131868 0.001857 0.004342 -0.089677 -0.133242 -0.132764 -0.068695 0.156346 0.169997 -0.049252
polarizability: 2.66608356e+02 -2.09516401e+00 2.09038377e+02 -3.28822103e+00 -6.84292508e-01 1.82993950e+02
1716.lowfreq: -9.3431 -0.0005 -0.0004 0.0004 6.8133 11.6524 29.3667 44.0934 55.5039
frequency: 29.0637 44.0424 55.4811 72.1231 90.8711 97.3572 114.9113 121.4427 124.9578 165.2898 174.1707 200.6842 209.1361 217.1298 239.8731 246.7797 257.3249 267.7685 273.6646 304.6281 314.6175 320.3129 352.0889 357.3446 366.2863 367.3741 387.8478 415.2524 440.2547 461.4695 480.4127 496.3027 505.0759 514.6340 545.2231 554.1539 576.2816 583.7306 595.5021 622.0626 643.4728 671.6492 729.6263 744.5283 749.8650 795.9590 812.3542 814.1363 835.5032 873.1548 885.9418 897.7182 899.9621 917.3713 927.0932 936.7197 946.3852 950.6379 962.2692 971.3204 977.1951 997.1919 1002.4392 1022.2421 1023.9754 1033.4165 1047.5518 1056.7025 1061.8184 1083.3187 1092.7562 1099.6895 1109.5044 1113.7837 1125.0419 1136.6750 1141.2950 1154.1292 1167.4373 1177.6566 1185.6251 1200.3679 1203.5691 1214.2117 1222.0917 1226.4998 1228.8030 1247.9963 1249.5367 1261.6267 1265.5475 1272.8217 1275.0023 1290.0462 1290.4470 1301.5348 1304.1849 1311.8447 1325.0350 1328.1945 1334.0537 1337.6644 1344.2065 1347.8176 1364.1511 1366.0873 1368.3649 1385.1089 1404.8996 1428.5811 1435.8819 1439.2415 1445.2113 1453.1885 1466.9711 1468.3282 1470.8855 1473.6797 1477.9387 1478.6071 1483.5813 1491.1577 1497.7596 1614.7720 1624.2753 1634.2667 2893.8061 2907.7671 2952.8343 2957.4933 2963.6913 2969.9008 2973.2871 2974.0922 2977.1501 2978.6403 2981.4329 2982.3359 2985.3900 2991.1036 2995.9764 3014.8092 3024.0966 3034.0793 3044.5557 3055.2402 3059.0797 3061.0634 3061.8433 3065.5851 3074.5048 3074.8865 3080.4604 3097.5196 3103.1033 3119.9545
redmass: 7.5540 4.0810 5.4194 3.8417 3.1160 3.4431 1.1486 3.3217 3.4685 3.1384 2.4543 2.9080 2.8471 3.2677 1.8486 1.2065 1.4447 3.3362 2.8092 2.8144 2.8510 3.6093 2.4062 2.8417 3.2094 2.8678 3.7488 2.9796 2.8730 2.9533 3.3546 3.3823 2.6840 2.1468 2.8655 3.1417 3.4209 3.5374 2.7393 3.5456 2.8300 2.5486 3.1463 2.8426 2.8238 2.6383 2.1819 2.3886 1.6808 1.7835 1.9574 2.0206 2.2890 3.3419 2.3873 2.2831 1.9274 1.8328 1.9760 1.9870 1.9932 1.9940 2.1029 1.9068 1.9797 1.8605 2.3563 2.0270 2.6158 2.2036 1.6863 1.9163 1.3878 1.9317 2.2170 2.3953 1.8744 1.7252 1.7192 1.7909 2.1641 1.8921 2.5366 1.4084 1.6998 1.6866 1.4805 1.7641 1.5960 1.4289 1.4523 1.3998 1.4170 1.4446 1.4512 1.4249 1.4782 1.4369 1.4665 1.4518 1.5266 1.5137 1.3591 1.4141 1.4604 1.4135 1.2784 1.2044 1.1958 1.0808 1.0811 1.0864 1.0728 1.0602 1.0737 1.0760 1.0849 1.0748 1.0589 1.0692 1.0580 1.0807 1.0569 9.2874 7.4621 10.6514 1.0784 1.0811 1.0779 1.0652 1.0637 1.0675 1.0736 1.0642 1.0540 1.0465 1.0627 1.0662 1.0671 1.0409 1.0600 1.0633 1.0972 1.1006 1.0953 1.1000 1.0967 1.0971 1.0952 1.0945 1.0981 1.0941 1.1036 1.0986 1.0976 1.1003
irintensity: 3.1745 3.7323 2.7363 2.0965 2.8760 1.7682 0.4442 0.6808 2.9148 1.1814 0.5634 0.1464 0.0793 0.8016 5.8569 1.0980 1.7002 0.7920 2.9532 0.9210 0.3669 0.8020 0.1952 4.1877 0.5648 0.3428 0.9106 0.9042 1.0569 1.6276 4.6281 5.6768 1.3882 7.5797 0.9172 4.9577 13.5091 1.4537 0.3099 10.6052 8.0800 0.3023 1.3622 3.5980 1.1758 1.8661 0.6825 1.7268 2.4396 0.9344 6.5190 0.4382 2.1726 6.0481 6.2015 3.6924 6.9416 2.1447 0.3422 3.1153 1.9017 0.1804 2.2406 6.3541 10.1568 7.8219 7.2276 1.7055 4.6414 18.9826 0.5909 3.6287 6.1417 3.6194 10.7797 17.4553 0.9859 40.0069 17.0592 6.3081 21.1999 40.7094 18.4096 0.4629 38.2386 31.4836 29.1273 18.6457 7.3162 22.7761 5.4802 9.3825 14.3010 14.7518 1.4497 7.7492 5.7158 21.1022 3.8734 17.6880 9.9192 8.1840 3.4833 4.6354 1.4319 7.1075 66.7135 27.4281 29.4017 10.8005 29.2244 8.8572 17.2360 12.3235 1.6732 22.7137 7.3860 12.0096 2.7367 6.1602 3.1792 9.0137 10.0312 148.1436 100.8346 215.1140 8.7484 19.4531 15.0474 11.2103 9.6139 7.7369 12.5813 9.1548 3.1066 14.0853 42.0669 41.7068 68.6894 13.6147 34.5093 30.0807 35.8501 57.5927 25.7406 18.1855 12.3211 51.7770 14.5753 13.7649 33.3748 16.1139 32.2802 16.0908 9.5452 14.6003
temp: 298.150 k
press: 1.00000 atm
elementType: 8 8 8 6 6 6 6 6 6 6 6 6 6 6 6 6 6 6 6 6 6 6 6 6 1 1 1 1 1 1 1 1 1 1 1 1 1 1 1 1 1 1 1 1 1 1 1 1 1 1 1 1 1 1
symmnumber: 1
zpe: 1222881.2 jmol-1
zpe.correction: 0.465771 hartree
zpe.thermalcorrener: 0.488835 hartree
zpe.thermalcorrenthalpy: 0.489779 hartree
zpe.thermalcorrgfe: 0.414965 hartree
zpe.sumelectzpe: -1042.060838 hartree
zpe.sumelectthermal: -1042.037774 hartree
zpe.sumelectthermalent: -1042.036830 hartree
zpe.sumelectthermalfe: -1042.111644 hartree
dipole: -1.6088 2.0041 -0.6736
dipole: 2.6568
quadrupole: -186.3585 -146.8886 -147.2104
quadrupole: 5.2342 26.7431 4.1782
quadrupole: -26.2060 13.2639 12.9421 5.2342 26.7431 4.1782
hfenergy: -1042.5266089 hartree
pointgroup: C01 [X(C21H30O3)]
dipole: 0.6318458 -0.7924928 -0.2555286 debye
polarizability: 266.6571409|-1.9775535|209.0505931|2.7026209|0.2347554|182.9329492 unknown
InChI: InChI=1S/C21H30O3/c1-12(22)16-6-7-17-15-5-4-13-10-14(23)8-9-20(13,2)19(15)18(24)11-21(16,17)3/h13,15-17,19H,4-11H2,1-3H3
charge 0 multiplicity 1
54 atoms
O  -0.20085 2.553667 0.73884
O  5.603084 0.172111 0.409503
O  -5.615711 0.141605 -1.894538
C  1.356511 -1.118503 -0.273808
C  0.003788 -1.068219 0.46435
C  2.258328 0.130501 -0.004925
C  -0.773182 0.23919 0.063229
C  -2.177226 0.398164 0.749071
C  -3.023359 -0.917032 0.528719
C  3.545856 -0.288573 -0.827202
C  -0.875551 -2.298583 0.141927
C  2.301384 -2.318762 -0.025517
C  1.504919 1.382259 -0.529352
C  -2.239039 -2.212571 0.855995
C  0.133143 1.487868 0.154263
C  3.69614 -1.817818 -0.531673
C  -2.930021 1.614419 0.08378
C  2.599553 0.321962 1.495742
C  -3.673117 -0.953867 -0.878063
C  -2.049367 0.646245 2.278198
C  -4.445645 1.379712 -0.127044
C  4.798882 0.529279 -0.494508
C  -4.680739 0.187751 -1.052157
C  5.033251 1.799624 -1.302833
H  1.127912 -1.104593 -1.366005
H  0.188375 -1.056373 1.558118
H  -0.956718 0.125862 -1.033762
H  -3.8609 -0.869646 1.256769
H  3.303353 -0.124886 -1.897612
H  -0.351006 -3.222514 0.451893
H  -1.015728 -2.367771 -0.957735
H  1.970753 -3.227382 -0.557948
H  2.337479 -2.56783 1.052002
H  1.353046 1.288082 -1.625495
H  2.046993 2.323415 -0.329251
H  -2.862368 -3.090158 0.593909
H  -2.068066 -2.269641 1.949432
H  4.483671 -1.966213 0.227106
H  4.013718 -2.353973 -1.443594
H  -2.480731 1.835842 -0.90515
H  -2.76641 2.518295 0.693046
H  3.223774 1.221742 1.640322
H  1.689651 0.458985 2.10718
H  3.165758 -0.532792 1.901703
H  -4.194936 -1.911158 -1.063746
H  -2.911709 -0.861686 -1.680596
H  -1.436405 1.538803 2.48092
H  -3.052355 0.81472 2.715321
H  -1.601806 -0.214752 2.807806
H  -4.943441 2.268779 -0.55244
H  -4.941165 1.17104 0.844482
H  5.318406 1.529417 -2.338921
H  4.11181 2.40605 -1.375172
H  5.843312 2.396506 -0.855577
