program: Gaussian 09
title: 000102243
version: EM64L-G09RevD.01
frameworkgroup: C1[X(C23H26F2O5)]
method: RPBEPBE
basis: SDD
operation: Freq
keyword: #p
keyword: freq=noraman
keyword: PBEPBE/SDD
title: #p freq=noraman PBEPBE/SDD
converged: YES YES NO NO
title: Mulliken charges:
elementType: F F O O O O O C C C C C C C C C C C C C C C C C C C C C C C H H H H H H H H H H H H H H H H H H H H H H H H H H
charge: -0.214654 -0.218016 -0.470516 -0.208932 -0.241563 -0.241483 -0.242132 -0.265906 -0.157865 0.305132 0.281031 0.031882 -0.232081 -0.631793 -0.482761 -0.584282 0.287779 0.455966 -0.168784 -0.834020 -0.346904 -0.761089 -0.181608 -0.581048 0.093545 -0.392621 0.195412 -0.408153 0.303252 -0.753092 0.263711 0.281523 0.256244 0.244487 0.266766 0.233737 0.258751 0.241072 0.239973 0.217997 0.251377 0.258400 0.223249 0.245760 0.288315 0.242973 0.207025 0.270238 0.361033 0.294986 0.254165 0.252031 0.257855 0.261293 0.248458 0.243884
chargesum: 0.00000
title: Mulliken charges with hydrogens summed into heavy atoms:
elementType: F F O O O O O C C C C C C C C C C C C C C C C C C C C C C C
charge: -0.214654 -0.218016 -0.109484 -0.208932 -0.241563 -0.241483 -0.242132 -0.002194 0.123658 0.305132 0.281031 0.031882 0.024163 -0.120539 0.009727 -0.103238 0.287779 0.455966 0.049214 -0.100995 -0.101143 -0.022776 0.088630 -0.286062 0.093545 -0.138457 0.195412 0.101733 0.303252 0.000543
polarizability: 3.33224931e+02 4.15396184e+00 2.43311483e+02 -2.89323277e+01 2.83291231e+00 1.98826580e+02
1716.lowfreq: -7.8804 -0.0004 -0.0001 0.0005 2.5762 9.0742 16.2673 24.2427 35.5304
frequency: 16.0197 24.2076 35.5084 47.2864 52.4017 58.0483 82.3238 90.4081 94.4160 117.1442 139.5757 143.7269 167.8454 171.0084 192.1351 198.5225 207.3199 214.9562 224.9186 228.6187 247.4120 256.8109 264.9211 271.1136 275.0403 291.9278 293.9881 301.8707 312.4677 328.1613 337.6634 356.8646 389.4789 395.3337 415.9166 426.9756 435.1434 444.2365 451.5026 485.4406 494.7506 501.8447 513.8100 530.6460 551.1232 556.8927 591.4719 594.5190 612.9396 645.6094 648.3278 668.5771 689.0857 694.1000 708.2855 742.8620 758.0325 787.2552 815.3578 825.6630 833.4917 842.7729 856.0868 870.4702 889.2156 899.4943 925.7399 931.3761 944.1806 953.6313 954.3890 960.9701 974.6549 981.1911 998.6180 1004.7108 1007.0936 1013.1855 1019.1686 1034.8041 1042.2679 1042.3560 1050.3240 1053.6167 1076.4349 1092.6432 1104.0080 1122.5387 1127.1286 1132.9380 1142.2621 1162.2389 1173.5951 1182.5011 1193.0234 1199.1601 1223.7633 1225.8315 1238.1879 1242.9260 1254.0859 1263.6718 1281.9201 1283.0621 1292.2033 1294.9251 1304.4357 1307.7954 1320.2537 1333.1427 1339.5332 1345.4223 1354.4474 1355.1415 1372.9681 1381.0682 1381.4071 1383.0933 1391.3473 1393.7631 1418.5864 1453.0531 1453.4202 1453.9890 1458.3422 1466.2526 1466.7318 1476.7047 1490.4842 1505.7021 1560.5445 1578.1536 1595.0491 1624.5962 1666.6424 1670.2774 2953.2732 2971.5193 2972.7049 2986.6533 2991.5116 2992.5448 3000.2483 3003.4305 3008.7337 3009.6904 3011.5387 3043.5393 3047.3270 3076.3447 3078.2663 3089.3799 3093.3057 3098.1874 3101.3354 3114.0219 3131.7057 3142.3699 3148.6825 3152.5999 3164.8158 3566.5712
redmass: 5.0787 6.4092 8.0268 4.3340 5.7221 6.2198 1.9625 1.5877 6.0170 4.8720 3.8380 6.1315 4.3162 5.7035 5.3315 2.5992 4.8618 2.9373 2.7695 3.2278 2.2614 2.9798 2.3843 2.1980 3.1293 2.9077 1.9995 2.5526 6.6697 1.4335 3.8599 3.1967 6.5372 3.3817 3.5549 5.3294 3.2781 3.2198 4.7966 3.2026 3.7853 3.2428 4.3236 4.6252 3.8658 3.2824 3.8753 4.0374 4.4041 4.6795 3.5177 3.8757 3.6721 3.0855 3.8467 5.1533 3.9680 4.5018 2.5087 1.5625 1.9154 2.5375 3.1979 3.0786 3.1656 2.6466 1.7248 1.9891 3.0863 1.9119 2.8063 2.0907 2.0742 1.9965 2.3718 1.3324 2.2610 2.6283 2.2584 3.7271 2.3592 2.4563 2.9044 2.1923 3.0608 2.3400 1.9401 2.3064 2.0552 1.7934 1.7684 1.8450 2.4065 1.7984 2.1173 2.4693 1.4547 2.0065 1.1446 1.6633 1.3711 1.5801 1.6556 1.6930 1.6205 1.4983 1.4712 1.5841 1.5673 1.4187 1.4918 1.4166 1.8013 1.7431 1.9846 1.4882 1.4833 1.2414 1.2278 1.2525 1.1084 1.0613 1.0948 1.0544 1.0889 1.0902 1.0650 1.0577 1.0504 1.0587 9.1847 8.8079 7.3229 8.7315 9.4380 7.6673 1.0689 1.0804 1.0794 1.0370 1.0775 1.0643 1.0434 1.0606 1.0376 1.0702 1.0699 1.0934 1.1005 1.0989 1.1038 1.0993 1.1001 1.0991 1.0953 1.0871 1.0990 1.1021 1.0955 1.0979 1.0923 1.0660
irintensity: 1.7078 1.8638 0.7810 1.0815 1.4565 0.4049 7.4947 4.7141 0.9959 0.4100 0.0472 1.7611 0.6416 2.6715 4.8811 1.8610 0.2694 2.5496 0.3263 7.5230 2.9544 4.4922 5.4840 24.6301 13.9912 4.3512 50.8466 28.3881 5.5323 57.2725 16.2770 2.3220 14.8897 0.8469 21.0776 2.8187 4.7756 0.8565 1.3508 1.9523 5.6866 2.6891 0.9448 6.2989 7.8544 3.4668 6.1910 3.5150 0.7418 2.5273 1.7311 4.7538 1.1453 22.6059 3.4723 25.3377 3.6109 33.2290 4.6232 2.8123 27.8234 1.5897 22.3587 5.7599 31.7260 93.3592 8.1742 16.1533 14.0109 33.0671 45.9377 44.6339 21.4081 39.3774 10.0301 0.7464 12.3735 13.0997 4.8791 63.6779 33.2646 7.2859 33.6761 19.4831 9.2378 4.5117 8.5868 14.8196 1.2197 19.9877 13.9391 8.8032 12.3991 29.2791 147.2848 172.2578 4.0914 11.1922 7.5078 26.5094 6.7552 1.8014 18.3327 19.1513 0.1422 15.3949 7.0621 10.5081 4.7750 1.4206 10.1113 12.8294 30.9779 25.9687 10.0827 7.9522 2.5011 62.3390 17.8444 33.7308 28.9167 27.0542 15.9673 21.0232 8.7963 9.3543 8.4898 5.8030 10.9680 13.8232 202.7279 51.6717 114.5198 8.8782 158.3276 103.4200 11.1037 23.6006 5.5810 26.2428 8.5259 19.1288 25.3001 27.8144 2.0127 15.4338 23.0639 14.5269 17.7303 12.2057 15.2589 35.9406 2.9335 13.8249 8.4329 3.0776 2.2329 9.0907 19.5866 12.1112 0.0616 8.4369
temp: 298.150 k
press: 1.00000 atm
elementType: 9 9 8 8 8 8 8 6 6 6 6 6 6 6 6 6 6 6 6 6 6 6 6 6 6 6 6 6 6 6 1 1 1 1 1 1 1 1 1 1 1 1 1 1 1 1 1 1 1 1 1 1 1 1 1 1
symmnumber: 1
zpe: 1166749.7 jmol-1
zpe.correction: 0.444392 hartree
zpe.thermalcorrener: 0.473064 hartree
zpe.thermalcorrenthalpy: 0.474008 hartree
zpe.thermalcorrgfe: 0.385166 hartree
zpe.sumelectzpe: -1465.577002 hartree
zpe.sumelectthermal: -1465.548329 hartree
zpe.sumelectthermalent: -1465.547385 hartree
zpe.sumelectthermalfe: -1465.636227 hartree
dipole: -6.4507 1.2230 2.6215
dipole: 7.0696
quadrupole: -228.3885 -163.5109 -181.6724
quadrupole: 0.0881 32.7949 -4.1084
quadrupole: -37.1979 27.6797 9.5182 0.0881 32.7949 -4.1084
hfenergy: -1466.0213934 hartree
pointgroup: C01 [X(C23H26F2O5)]
dipole: -2.5314568 0.3407764 1.1008186 debye
polarizability: 332.1134606|8.5243681|242.8857128|-30.399494|5.6565501|200.3638206 unknown
InChI: InChI=1S/C23H26F2O5/c1-12(26)30-11-19(28)15-5-4-14-16-9-18(24)17-8-13(27)6-7-22(17,3)23(16,25)20(29)10-21(14,15)2/h5-8,14,16,18,20,29H,4,9-11H2,1-3H3
charge 0 multiplicity 1
56 atoms
F  1.765967 -0.115175 -1.388202
F  4.35106 2.943286 0.139509
O  0.72234 -2.207584 1.425417
O  -3.938321 -1.265458 -0.031675
O  6.54176 -1.028987 -1.926556
O  -6.18677 -0.185989 -1.147231
O  -6.805859 -0.094051 1.100878
C  1.09324 1.006549 0.649922
C  -0.310771 1.238183 0.065494
C  1.631038 -0.345308 0.086333
C  -1.316515 0.102494 0.449084
C  3.107306 -0.661317 0.574433
C  0.632279 -1.549013 0.10373
C  -0.82982 -1.178005 -0.266108
C  2.0558 2.166401 0.283625
C  -1.094175 2.551179 0.327435
C  -2.629637 0.745355 -0.040361
C  3.977843 0.526214 0.147384
C  3.512569 1.866872 0.674781
C  -1.473109 -0.114418 1.98684
C  -2.503231 2.113133 -0.050742
C  3.198372 -0.813951 2.138121
C  3.591286 -1.974531 -0.013276
C  5.078938 0.394122 -0.645369
C  -3.869125 -0.026068 -0.278757
C  4.695865 -2.09352 -0.799191
C  5.512905 -0.915593 -1.18245
C  -5.087076 0.734249 -0.845198
C  -6.950737 -0.59612 -0.033524
C  -7.915806 -1.682624 -0.43667
H  1.024296 0.912695 1.75045
H  -0.200218 1.1809 -1.038107
H  1.004905 -2.255694 -0.666341
H  -0.872996 -1.022986 -1.360993
H  -1.491165 -2.03779 -0.043307
H  1.731073 3.097502 0.781382
H  2.027853 2.331439 -0.80877
H  -0.737784 3.407863 -0.272351
H  -1.063757 2.868524 1.392425
H  3.644362 1.922892 1.774077
H  -2.278057 -0.848538 2.169999
H  -0.549648 -0.501002 2.447276
H  -1.760089 0.825007 2.493335
H  -3.307749 2.82793 -0.257087
H  2.629334 -1.694838 2.466695
H  4.259668 -0.932803 2.417147
H  2.801661 0.067288 2.671346
H  3.020267 -2.860935 0.292054
H  -0.054554 -2.814362 1.519742
H  5.679179 1.267183 -0.920161
H  5.035234 -3.06537 -1.175665
H  -5.4181 1.494881 -0.112046
H  -4.837426 1.217043 -1.803914
H  -7.371964 -2.643892 -0.475174
H  -8.326922 -1.491107 -1.4406
H  -8.724619 -1.760856 0.304411
