program: Gaussian 09
title: 000100076
version: EM64L-G09RevD.01
frameworkgroup: C1[X(C17H22N2)]
method: RPBEPBE
basis: SDD
operation: Freq
keyword: #pfreq=noraman
keyword: PBEPBE/SDD
title: #p freq=noraman PBEPBE/SDD
converged: YES YES NO NO
title: Mulliken charges:
elementType: N N C C C C C C C C C C C C C C C C C H H H H H H H H H H H H H H H H H H H H H H
charge: -0.064030 -0.156992 -0.260821 -0.150300 -0.497669 0.002479 -0.603036 -0.471820 0.498107 -0.212772 0.364295 0.257230 -0.746965 -0.646835 -0.458815 -0.507264 -0.379685 -0.211542 -0.633070 0.223915 0.230121 0.217906 0.220132 0.209604 0.234825 0.222332 0.207692 0.203376 0.212644 0.208388 0.216860 0.221645 0.226674 0.189022 0.260084 0.232607 0.229122 0.211751 0.229043 0.235869 0.235890
chargesum: 0.00000
title: Mulliken charges with hydrogens summed into heavy atoms:
elementType: N N C C C C C C C C C C C C C C C C C
charge: -0.064030 -0.156992 -0.036906 0.079821 -0.059631 0.212083 -0.145879 -0.060751 0.498107 -0.212772 0.364295 0.257230 -0.109073 -0.009495 -0.198731 -0.274657 -0.150563 0.000209 0.067731
polarizability: 2.46131845e+02 8.70557465e-01 1.99227247e+02 5.68124897e+00 1.42901409e+01 1.35172208e+02
1716.lowfreq: -14.7680 -3.0168 -0.0007 -0.0004 0.0006 6.8348 34.2647 48.0675 71.0266
frequency: 34.2621 48.0138 70.9687 121.8926 139.7387 147.3772 152.8498 193.4411 207.5002 210.2841 229.2178 243.8799 256.7564 278.1184 294.1781 320.4426 339.9110 399.8559 415.2779 431.9148 477.7131 493.1637 525.4515 533.8081 546.4904 566.6311 598.8434 619.9360 635.6045 663.4976 713.2254 751.1109 772.3850 784.0837 790.9735 794.5565 839.6123 844.6815 877.3059 883.0586 917.2193 937.5143 948.8099 964.9281 970.7251 1007.0282 1030.9690 1034.2959 1039.2558 1059.7796 1071.2591 1096.0544 1098.0955 1117.4900 1118.4002 1122.3480 1146.7522 1160.8142 1167.3936 1174.5770 1185.7427 1200.5811 1220.4342 1231.6562 1260.2731 1274.5156 1288.7901 1297.1112 1302.1864 1309.6272 1312.7213 1331.3125 1331.7705 1349.7961 1361.8741 1370.3049 1383.5350 1384.6241 1417.9607 1431.5394 1433.1896 1456.8642 1461.5627 1463.3039 1466.2066 1471.5116 1474.9897 1476.5581 1478.3304 1485.4958 1489.3244 1499.1888 1563.3462 1611.3080 1624.4506 2870.0684 2948.6583 2958.8570 2962.1475 2964.3305 2970.2191 2970.9573 2976.6129 2997.5722 3010.4449 3022.9533 3031.1725 3045.0420 3045.1800 3057.5799 3064.3191 3069.4687 3101.6774 3114.1415 3131.4633 3152.5916 3209.1747
redmass: 1.1232 3.2443 3.6368 2.7871 2.7374 2.5157 2.3941 1.2020 1.1122 2.8663 3.3296 3.0266 3.0388 3.7144 3.0781 3.1527 3.6451 2.6774 2.8881 3.0202 2.9270 3.4084 3.8240 3.9993 4.5380 4.9775 3.1455 4.5992 2.8992 3.5431 4.8687 1.4329 1.6486 4.2376 2.9104 2.5858 2.5644 2.7078 1.5099 1.6937 1.7012 1.9257 1.3261 2.6200 2.2549 1.9344 2.1999 2.3500 1.9966 2.4004 2.3000 2.6327 2.0522 1.3315 1.4962 1.7940 2.1449 1.7897 1.3240 1.6839 1.7293 1.5860 1.4257 1.7704 1.4193 1.5604 1.4729 1.3000 1.3352 1.9959 2.1172 1.3105 1.3592 1.4904 2.4210 1.5769 3.2603 1.2356 4.7548 1.5271 1.2137 1.1002 1.0852 1.0768 1.0419 1.1165 1.1389 1.5316 1.2790 1.6265 1.0509 1.6526 6.8105 7.8293 8.5437 1.0555 1.0791 1.0685 1.0617 1.0470 1.0654 1.0374 1.0652 1.0835 1.0732 1.1010 1.1006 1.1007 1.0974 1.0989 1.0992 1.1005 1.0982 1.0863 1.0907 1.0980 1.0977
irintensity: 0.4401 0.9999 0.4385 2.7630 2.0066 3.6289 0.5612 0.6061 0.0026 2.4994 0.0739 2.6453 0.4271 0.0098 0.5442 0.3300 0.8482 1.9415 1.1629 5.3317 4.0145 7.6904 1.9305 0.5876 4.2678 3.2588 1.1537 2.4607 1.2362 1.1965 5.1265 67.8374 39.7250 3.4122 2.0522 7.4225 0.4536 9.1273 2.9733 8.4497 1.1125 3.6216 1.1388 1.9187 1.6532 6.0935 40.2837 28.2195 3.9041 24.9719 12.2127 8.1825 12.4253 1.3054 12.5287 7.5447 6.6551 15.5256 2.6068 8.4956 2.7198 2.7417 0.9366 3.7868 10.4123 3.4302 9.9470 2.8463 8.9461 14.7370 26.3358 1.2690 4.1561 0.0753 17.6471 2.4776 10.9084 12.5815 17.3765 12.3371 7.3354 3.1390 10.5644 11.4069 12.5070 15.8226 11.1083 30.7406 50.4617 11.7855 7.7946 7.5621 5.0556 6.9006 14.3477 96.4574 6.8129 17.2092 6.3141 48.4072 92.1801 85.6675 49.9409 32.8914 55.7346 33.0388 45.2085 11.2006 48.4209 68.8833 36.7002 43.0146 12.4415 7.3630 19.7799 36.7816 1.8370
temp: 298.150 k
press: 1.00000 atm
elementType: 7 7 6 6 6 6 6 6 6 6 6 6 6 6 6 6 6 6 6 1 1 1 1 1 1 1 1 1 1 1 1 1 1 1 1 1 1 1 1 1 1
symmnumber: 1
zpe: 925959.5 jmol-1
zpe.correction: 0.352679 hartree
zpe.thermalcorrener: 0.369853 hartree
zpe.thermalcorrenthalpy: 0.370797 hartree
zpe.thermalcorrgfe: 0.308473 hartree
zpe.sumelectzpe: -769.102340 hartree
zpe.sumelectthermal: -769.085167 hartree
zpe.sumelectthermalent: -769.084222 hartree
zpe.sumelectthermalfe: -769.146546 hartree
dipole: -1.1309 -0.5129 -0.4074
dipole: 1.3069
quadrupole: -94.7213 -112.0844 -115.9979
quadrupole: 7.7577 4.0690 3.1182
quadrupole: 12.8799 -4.4832 -8.3967 7.7577 4.0690 3.1182
hfenergy: -769.4550198 hartree
pointgroup: C01 [X(C17H22N2)]
dipole: 0.4412935 0.2115389 -0.1577575 debye
polarizability: 246.0942784|1.8000712|199.5576329|-5.2924791|-13.744065|134.8793891 unknown
InChI: InChI=1S/C17H22N2/c1-11-7-14-13-5-4-6-15-17(13)12(10-19(15)3)8-16(14)18(2)9-11/h4-6,10-11,14,16H,7-9H2,1-3H3
charge 0 multiplicity 1
41 atoms
N  -2.74597 1.190585 0.79792
N  3.209434 1.046298 -0.416086
C  -1.089077 -0.718056 0.484295
C  -1.303821 0.820539 0.785107
C  -1.830486 -1.119093 -0.82642
C  -3.334225 -0.749183 -0.765226
C  -0.508967 1.773437 -0.170243
C  -3.470753 0.764026 -0.426036
C  0.392583 -1.068475 0.430366
C  1.267893 -0.024089 0.06206
C  0.937107 1.345082 -0.229706
C  2.679795 -0.200169 -0.052489
C  -4.062465 -1.088076 -2.081861
C  -3.442381 0.852731 2.056946
C  2.144091 1.978773 -0.51823
C  0.977092 -2.324443 0.691473
C  3.266664 -1.463479 0.198904
C  2.390897 -2.510039 0.57163
C  4.626328 1.331831 -0.636801
H  -1.564343 -1.28425 1.313457
H  -0.914251 1.006315 1.806157
H  -1.358327 -0.609042 -1.691809
H  -1.707563 -2.206139 -1.000661
H  -3.798727 -1.335385 0.057183
H  -0.635339 2.805826 0.202261
H  -0.960823 1.750098 -1.182077
H  -3.089571 1.347934 -1.288936
H  -4.536993 1.035284 -0.30378
H  -5.140602 -0.845267 -2.02223
H  -3.633548 -0.514319 -2.926535
H  -3.969929 -2.16279 -2.326182
H  -4.46871 1.262237 2.024317
H  -2.915318 1.329152 2.903542
H  -3.522088 -0.239592 2.280509
H  2.352744 3.013919 -0.785747
H  0.350977 -3.173442 0.992606
H  4.345183 -1.638699 0.120494
H  2.812253 -3.500573 0.780304
H  4.749401 2.393151 -0.906169
H  5.220575 1.13456 0.275488
H  5.033662 0.715222 -1.460197
