program: Gaussian 09
title: 000100075
version: EM64L-G09RevD.01
frameworkgroup: C1[X(C17H20N2)]
method: RPBEPBE
basis: SDD
operation: Freq
keyword: #pfreq=noraman
keyword: PBEPBE/SDD
title: #p freq=noraman PBEPBE/SDD
converged: YES YES NO NO
title: Mulliken charges:
elementType: N N C C C C C C C C C C C C C C C C C H H H H H H H H H H H H H H H H H H H H
charge: -0.080534 -0.156220 -0.200295 -0.252552 -0.597192 0.479463 0.378302 -0.206219 -0.420022 -0.476612 0.407783 0.253097 -0.462885 -0.484873 -0.639578 -0.378452 -0.214421 -0.823989 -0.632914 0.238106 0.237175 0.236519 0.215237 0.242991 0.217612 0.179527 0.259006 0.235602 0.188129 0.220250 0.225816 0.229162 0.212540 0.233266 0.219973 0.216453 0.236217 0.235893 0.228639
chargesum: 0.00000
title: Mulliken charges with hydrogens summed into heavy atoms:
elementType: N N C C C C C C C C C C C C C C C C C
charge: -0.080534 -0.156220 0.037811 -0.015376 -0.145436 0.479463 0.378302 -0.206219 -0.177030 -0.079473 0.407783 0.253097 -0.203879 -0.249271 -0.005383 -0.149290 -0.001881 -0.154298 0.067835
polarizability: 2.48259086e+02 -7.06848969e+00 1.99762875e+02 1.47509704e+00 -1.77467151e+01 1.33126498e+02
1716.lowfreq: -23.4549 -9.5403 -0.0004 0.0002 0.0006 2.5546 7.2770 48.6238 70.2649
frequency: -21.0641 48.6137 70.2341 117.0455 132.1840 142.8182 149.8400 171.2384 223.9999 226.1696 230.4557 244.3305 249.4676 278.1648 293.0496 315.9712 349.1416 400.6109 424.3180 439.1245 473.8690 485.8256 525.5047 533.9531 555.7496 562.5788 602.5239 619.6234 657.4939 702.0974 717.7721 752.0603 775.7696 787.9674 792.5455 809.6424 842.1225 864.1626 876.5400 892.7420 947.5242 951.5949 960.8734 973.5384 994.6474 1024.8860 1032.1863 1042.8623 1051.0635 1057.4702 1088.2871 1112.9027 1116.8012 1124.5428 1148.2557 1153.3922 1161.9965 1171.1469 1191.9807 1200.7028 1202.6891 1211.6148 1244.1233 1262.8968 1271.7613 1283.4880 1310.6437 1315.6367 1330.8557 1355.3578 1361.7129 1376.0819 1384.2176 1391.9337 1418.2533 1431.0421 1433.8017 1453.3385 1460.6715 1461.2791 1465.1105 1468.3241 1474.4346 1476.6926 1486.2050 1490.7202 1500.2895 1562.1497 1611.9863 1627.0307 1694.0461 2788.4339 2856.9594 2954.8634 2958.2671 2961.8966 2969.8165 2971.3498 2995.2355 3004.6645 3026.3283 3030.9105 3045.3941 3068.5812 3080.9617 3102.3230 3103.8987 3116.0610 3132.2691 3153.0520 3209.2788
redmass: 1.0699 3.6196 3.8636 2.4682 2.7337 1.5100 2.3990 1.9341 2.4717 1.3939 3.0372 2.8483 2.4805 3.7037 3.6418 3.1066 4.1947 3.1453 2.7582 3.0617 4.8038 4.4166 3.8991 4.0401 4.8008 4.6883 3.3998 4.4647 4.7878 2.9121 2.9305 1.4560 1.7863 4.2323 2.5070 2.1868 2.1151 3.1268 1.5682 2.7859 1.6854 2.0805 2.0193 1.7571 2.1545 2.2308 2.0837 1.9583 1.8392 1.7097 3.1847 1.4988 1.3043 2.7965 1.4576 1.6053 2.0014 1.3540 1.7547 1.4439 1.5504 1.3082 1.6970 1.7041 1.6183 2.0837 2.9845 1.4660 1.3058 1.5649 2.5757 1.9499 3.5272 1.2360 4.8643 1.6157 1.1679 1.1076 1.0627 1.0466 1.0442 1.0661 1.1298 2.4319 1.4952 1.0672 1.8254 6.7740 7.7550 8.7191 7.1927 1.0719 1.0567 1.0664 1.0531 1.0802 1.0601 1.0386 1.0843 1.0730 1.0967 1.0985 1.1018 1.0997 1.0977 1.0982 1.0919 1.0863 1.0909 1.0981 1.0977
irintensity: 0.1924 0.8429 0.8826 1.7100 4.8001 0.7951 1.4466 1.3725 2.5368 0.1290 0.8659 2.1389 0.7007 1.0558 0.6763 0.1365 2.6792 13.0334 0.2267 4.6038 1.2653 1.2417 1.5127 0.4532 2.4657 0.7917 2.1949 2.6005 0.5911 1.9808 10.5612 70.8958 38.1678 2.0887 2.9844 2.2170 10.4302 12.4966 1.0313 1.1276 1.9353 5.3353 4.0138 3.9213 0.5344 28.6260 36.6275 11.2006 6.6099 5.2516 3.2499 1.8514 0.6347 28.5318 12.4717 7.6923 18.2923 3.3746 4.5976 12.7713 3.3868 0.2419 23.0984 3.7998 3.3688 0.8073 54.5881 1.8421 2.1971 10.9560 15.4975 0.3446 11.5922 11.7800 17.0741 7.3412 7.0645 5.0370 17.5673 14.4776 13.1275 8.5770 18.3901 57.3532 12.3274 8.9314 5.7444 3.8575 6.8206 12.8598 2.8866 88.2883 130.1396 16.4116 105.7692 21.7884 51.5339 71.4928 32.7498 62.9435 28.7233 35.3010 31.0228 32.2355 23.3225 12.4431 20.3644 6.2028 20.2045 37.2424 1.8325
temp: 298.150 k
press: 1.00000 atm
elementType: 7 7 6 6 6 6 6 6 6 6 6 6 6 6 6 6 6 6 6 1 1 1 1 1 1 1 1 1 1 1 1 1 1 1 1 1 1 1 1
symmnumber: 1
zpe: 862465.1 jmol-1
zpe.correction: 0.328496 hartree
zpe.thermalcorrener: 0.344683 hartree
zpe.thermalcorrenthalpy: 0.345627 hartree
zpe.thermalcorrgfe: 0.286036 hartree
zpe.sumelectzpe: -767.911656 hartree
zpe.sumelectthermal: -767.895469 hartree
zpe.sumelectthermalent: -767.894525 hartree
zpe.sumelectthermalfe: -767.954116 hartree
dipole: -1.1156 -2.0990 1.2244
dipole: 2.6738
quadrupole: -94.4971 -105.8950 -115.2772
quadrupole: 2.7362 -1.1402 -1.5216
quadrupole: 10.7260 -0.6719 -10.0541 2.7362 -1.1402 -1.5216
hfenergy: -768.2401518 hartree
pointgroup: C01 [X(C17H20N2)]
dipole: 0.4422333 0.8299885 0.4713546 debye
polarizability: 248.2128669|-7.1816853|200.1962399|-1.5982167|17.0067046|132.7393527 unknown
InChI: InChI=1S/C17H20N2/c1-11-7-14-13-5-4-6-15-17(13)12(10-19(15)3)8-16(14)18(2)9-11/h4-7,10,14,16H,8-9H2,1-3H3
charge 0 multiplicity 1
39 atoms
N  -2.848951 0.851056 -0.898627
N  3.076508 1.141271 0.55257
C  -1.372348 0.708476 -0.853331
C  -1.05086 -0.819552 -0.71121
C  -0.677397 1.612436 0.237271
C  0.44922 -1.077475 -0.582133
C  0.796888 1.298904 0.296835
C  1.234183 -0.013652 -0.091431
C  -1.840179 -1.409244 0.45661
C  -3.547901 0.422048 0.32951
C  -2.982236 -0.850947 0.936362
C  2.649206 -0.104861 0.071533
C  1.94485 1.988795 0.682192
C  1.125176 -2.271391 -0.903208
C  -3.340602 2.138767 -1.410185
C  3.329706 -1.30533 -0.243649
C  2.541726 -2.375745 -0.728188
C  -3.76054 -1.429377 2.100854
C  4.460239 1.501415 0.857965
H  -0.984462 1.033127 -1.839818
H  -1.415192 -1.299312 -1.643832
H  -1.14942 1.406618 1.219408
H  -0.865246 2.677348 0.002949
H  -1.445231 -2.328588 0.909775
H  -4.617984 0.261139 0.077129
H  -3.546365 1.220274 1.123095
H  2.069473 3.008803 1.043789
H  0.571427 -3.131467 -1.299161
H  -3.194782 2.998415 -0.708167
H  -4.424549 2.0635 -1.619178
H  -2.828106 2.381689 -2.358276
H  4.413452 -1.4169 -0.129211
H  3.036156 -3.319467 -0.986952
H  -3.264633 -2.325534 2.511335
H  -4.78764 -1.715284 1.797614
H  -3.865655 -0.691538 2.921779
H  4.875605 0.851934 1.651564
H  5.102622 1.413527 -0.038552
H  4.498845 2.544722 1.210172
