program: Gaussian 09
title: 000100070
version: EM64L-G09RevD.01
frameworkgroup: C1[X(C12H14O4)]
method: RPBEPBE
basis: SDD
operation: Freq
keyword: #pfreq=noraman
keyword: PBEPBE/SDD
title: #p freq=noraman PBEPBE/SDD
converged: YES YES NO NO
title: Mulliken charges:
elementType: O O O O C C C C C C C C C C C C H H H H H H H H H H H H H H
charge: -0.298387 -0.298389 -0.248735 -0.248742 -0.050687 -0.050692 -0.350049 -0.350050 -0.313114 -0.313101 0.222617 0.222598 -0.330925 -0.330917 -0.252305 -0.252306 0.250677 0.250678 0.222517 0.227739 0.222518 0.227740 0.224710 0.216442 0.224723 0.216424 0.252543 0.252542 0.226964 0.226967
chargesum: 0.00000
title: Mulliken charges with hydrogens summed into heavy atoms:
elementType: O O O O C C C C C C C C C C C C
charge: -0.298387 -0.298389 -0.248735 -0.248742 0.199990 0.199985 0.100207 0.100208 0.128038 0.128047 0.222617 0.222598 -0.078382 -0.078375 -0.025340 -0.025339
polarizability: 1.65635949e+02 4.51667923e-03 1.70170908e+02 -7.64717066e-01 7.53534028e-03 9.05682205e+01
1716.lowfreq: -6.1152 -0.0009 -0.0005 -0.0005 4.1986 8.2611 35.4370 38.2831 43.5625
frequency: 35.4288 38.2827 43.5615 62.8261 67.9823 104.1083 120.3987 124.5815 178.9955 214.2928 230.8541 265.8851 292.0503 338.5844 400.7895 412.3888 438.6411 459.0057 536.2331 559.5123 562.9053 586.5409 722.8016 727.3656 742.7220 748.8525 782.1568 795.1288 800.7760 816.2147 830.7713 895.3191 900.1213 907.3083 957.5654 962.1458 966.8736 984.2991 984.7026 1028.4163 1028.6955 1049.9512 1097.6371 1098.3655 1112.3395 1112.8134 1113.9464 1139.9015 1140.0893 1173.9765 1191.1962 1214.0358 1214.6569 1238.4523 1238.6405 1246.8321 1283.0118 1349.3286 1349.5044 1391.7262 1416.4227 1418.2536 1432.8727 1472.4486 1472.7972 1481.5069 1483.6316 1496.8188 1593.9795 1601.7332 2962.6898 2963.2589 3025.7736 3025.9908 3071.6337 3071.6803 3118.4651 3118.5469 3136.8732 3151.1115 3163.7524 3175.2345 3181.7099 3181.8142
redmass: 5.3509 3.9684 4.3391 3.6591 4.1394 3.2872 4.9008 3.2554 5.8367 6.9001 4.1230 4.3516 5.0083 6.4503 2.1885 2.1632 5.4105 3.1568 6.1565 3.9690 5.2749 7.4953 4.2285 5.6538 1.4273 4.2397 7.0181 4.6840 4.2523 5.5337 1.4948 1.2325 1.2002 1.3312 1.4960 2.4019 2.6480 2.8007 2.3606 1.4301 1.4361 2.0874 1.3629 1.3678 1.5161 1.3290 1.8628 1.5466 1.5415 1.0514 2.8410 1.3198 1.3100 1.4666 1.4402 3.2412 1.4761 1.3486 1.3947 5.5124 1.9089 2.1077 2.3046 1.2313 1.1784 1.2740 1.1623 2.1177 6.1104 7.5325 1.0555 1.0555 1.1069 1.1069 1.0532 1.0532 1.0920 1.0920 1.0849 1.0896 1.0934 1.0999 1.1191 1.1191
irintensity: 1.9567 0.0228 0.2364 5.1751 1.4446 6.6690 8.9310 0.3182 0.0063 15.0925 4.9571 6.6259 0.0726 2.8321 1.1734 0.1172 16.5325 2.3532 5.5016 0.0018 2.9927 2.1203 0.0886 0.2332 74.0622 49.7824 21.0776 51.0435 2.7916 20.1271 0.2561 3.6248 7.0450 5.9315 2.2126 11.8313 27.7180 118.8390 12.8560 0.2273 0.0125 23.1056 5.4072 2.3764 106.0060 1.9671 71.0608 5.9760 0.2295 1.1666 156.3786 16.8957 2.7044 9.5994 9.1123 231.3317 13.2131 14.3497 12.6683 0.0118 0.8748 8.6519 35.1878 46.6691 4.5075 38.5908 4.5621 106.7927 64.0930 7.2336 66.1154 5.1805 0.4799 56.6646 8.8335 37.4361 20.3826 8.0733 0.0129 20.4265 27.3809 8.9747 10.6417 45.4695
temp: 298.150 k
press: 1.00000 atm
elementType: 8 8 8 8 6 6 6 6 6 6 6 6 6 6 6 6 1 1 1 1 1 1 1 1 1 1 1 1 1 1
symmnumber: 1
zpe: 619854.0 jmol-1
zpe.correction: 0.236090 hartree
zpe.thermalcorrener: 0.251609 hartree
zpe.thermalcorrenthalpy: 0.252554 hartree
zpe.thermalcorrgfe: 0.190812 hartree
zpe.sumelectzpe: -765.230999 hartree
zpe.sumelectthermal: -765.215480 hartree
zpe.sumelectthermalent: -765.214536 hartree
zpe.sumelectthermalfe: -765.276278 hartree
dipole: -0.0004 0.5846 -0.0005
dipole: 0.5846
quadrupole: -114.5613 -83.4759 -91.7876
quadrupole: 0.0030 6.1762 0.0028
quadrupole: -17.9530 13.1324 4.8206 0.0030 6.1762 0.0028
hfenergy: -765.4670893 hartree
pointgroup: C01 [X(C12H14O4)]
dipole: 0.2300101 -0.000543 0.0001724 debye
polarizability: 170.1709077|-0.0029491|165.6434623|-0.0171398|-0.1433287|90.5607077 unknown
InChI: InChI=1S/C12H14O4/c1-2-4-12(16-8-10-6-14-10)11(3-1)15-7-9-5-13-9/h1-4,9-10H,5-8H2
charge 0 multiplicity 1
30 atoms
O  -2.003838 4.643211 0.134176
O  -2.018539 -4.636702 -0.13475
O  -0.259186 1.319851 0.104444
O  -0.263428 -1.318839 -0.103428
C  -1.751357 3.167435 0.335606
C  -1.76158 -3.161556 -0.33512
C  -2.486749 3.628412 -0.881566
C  -2.497788 -3.621229 0.882053
C  -0.290335 2.782332 0.265424
C  -0.299321 -2.781099 -0.265402
C  1.004704 0.711796 0.058295
C  1.002412 -0.714755 -0.058189
C  2.233383 1.404629 0.116811
C  2.228865 -1.411471 -0.117453
C  3.458415 0.695795 0.057713
C  3.456169 -0.706516 -0.059169
H  -2.321029 2.718522 1.158428
H  -2.330265 -2.710211 -1.157294
H  -1.961344 3.657104 -1.844173
H  -3.575229 3.509587 -0.930083
H  -1.971994 -3.652326 1.844372
H  -3.585869 -3.49906 0.93121
H  0.233613 3.075007 1.198419
H  0.199342 3.285165 -0.592928
H  0.223206 -3.074859 -1.198851
H  0.189205 -3.286031 0.592377
H  2.248832 2.494876 0.204557
H  2.24084 -2.501768 -0.205083
H  4.40324 1.246978 0.103678
H  4.399223 -1.260676 -0.105675
