program: Gaussian 09
title: 000100065
version: EM64L-G09RevD.01
frameworkgroup: C1[X(C23H24N2O6)]
method: RPBEPBE
basis: SDD
operation: Freq
keyword: #p
keyword: freq=noraman
keyword: PBEPBE/SDD
title: #p freq=noraman PBEPBE/SDD
converged: YES YES NO NO
title: Mulliken charges:
elementType: O O O O O O N N C C C C C C C C C C C C C C C C C C C C C C C H H H H H H H H H H H H H H H H H H H H H H H H
charge: -0.290174 -0.251747 -0.308620 -0.264984 -0.276324 -0.262309 -0.377780 -0.019631 -0.356405 -0.442807 -0.631445 0.517408 0.241931 0.043328 0.317936 0.185781 0.059411 -0.552992 -0.305958 -0.017188 0.023744 0.055042 0.223614 -0.350522 0.211454 -0.271547 -0.778520 -0.526821 -0.514730 -0.523761 -0.503219 0.280189 0.234595 0.247224 0.257821 0.253464 0.323218 0.246519 0.233171 0.239619 0.209687 0.258348 0.252280 0.239278 0.236825 0.250642 0.265057 0.220315 0.242156 0.233118 0.234208 0.258557 0.225205 0.227269 0.279071
chargesum: 0.00000
title: Mulliken charges with hydrogens summed into heavy atoms:
elementType: O O O O O O N N C C C C C C C C C C C C C C C C C C C C C C C
charge: -0.290174 -0.251747 -0.308620 -0.264984 -0.276324 -0.262309 -0.054562 -0.019631 -0.076217 0.039012 -0.120161 0.517408 0.241931 0.043328 0.317936 0.185781 0.059411 -0.306473 -0.072787 -0.017188 0.023744 0.055042 0.223614 -0.110903 0.211454 -0.271547 -0.058204 0.199925 0.212798 0.202122 0.228326
polarizability: 4.58335992e+02 -1.62615157e+01 2.72752710e+02 8.56105516e+00 -2.22729691e+01 2.31348633e+02
1716.lowfreq: -4.4643 -0.0006 -0.0003 0.0008 3.5441 5.8289 17.2601 25.1281 28.5015
frequency: 17.1439 25.1083 28.4128 31.4035 39.3852 44.1164 54.2165 61.5838 67.7162 74.5890 75.3950 80.6001 89.7984 107.7710 115.8448 128.7836 132.4976 149.7057 153.0935 161.4358 167.8994 175.9479 190.4112 208.0271 216.7753 226.7772 251.4851 261.8619 262.9727 274.8227 300.6776 324.9264 339.8315 352.7805 358.8251 380.1876 386.4278 396.4322 407.4107 407.6884 413.7941 431.0329 461.4568 490.7459 493.3255 502.3070 522.2823 535.8726 547.7162 562.8942 585.0467 599.8730 607.0235 662.3075 670.5208 703.9028 710.3576 731.1021 734.4413 751.0734 780.0148 793.4164 804.1399 814.3232 855.8822 860.0592 876.5501 882.0151 909.4519 916.4888 929.8475 957.9966 968.0562 972.7423 986.5053 1000.8268 1026.4573 1039.0917 1057.4861 1075.8409 1086.7356 1102.2891 1103.0718 1109.8374 1110.1817 1111.5318 1123.3877 1139.6004 1150.3231 1154.4195 1156.7343 1159.4587 1197.2189 1222.1649 1236.5895 1251.9517 1254.4749 1271.9517 1282.3632 1318.8116 1324.3593 1328.1413 1336.1965 1348.0538 1371.5106 1384.1135 1385.1946 1389.9516 1402.7403 1426.5949 1428.9063 1434.3294 1439.5808 1444.6132 1448.7531 1450.0866 1454.9519 1458.5936 1459.0352 1462.6022 1463.7542 1465.6259 1471.3464 1474.0835 1478.6525 1480.1333 1482.9465 1491.7068 1525.4022 1547.0254 1557.4609 1577.8763 1603.4425 1618.3262 2176.3340 2978.9019 2983.8647 2988.8793 2992.8659 2994.0590 3001.2367 3007.8124 3039.1309 3055.3600 3071.6552 3080.5764 3087.4693 3093.8762 3098.2913 3099.5643 3106.6665 3116.1393 3117.7685 3128.3275 3131.0296 3142.4533 3143.3237 3155.5340 3557.7809
redmass: 6.7142 5.6733 5.4870 4.6926 2.8758 3.2799 2.0931 3.1832 2.7977 1.9092 1.8757 3.1476 2.6434 2.5621 2.8423 2.2604 2.2134 2.2267 2.6525 2.8045 2.0440 1.1308 4.1653 5.0811 3.8884 4.5255 4.1325 4.2120 4.6672 5.9375 4.3394 6.1780 4.0877 4.8438 4.5994 4.7728 5.0808 5.7006 3.9321 7.1708 4.4534 5.7292 6.8734 5.3597 4.1160 2.3049 3.0459 3.6577 6.0811 4.7443 3.6692 5.0211 3.1602 5.6885 5.8930 7.8614 4.5981 3.5832 4.5037 6.7893 5.5284 4.3543 4.1503 6.2292 1.9322 2.8428 3.4543 5.4275 4.8448 1.8655 6.9153 3.9803 2.8413 1.4215 2.6217 3.4595 2.6364 1.6565 4.5449 3.1772 3.3133 1.3871 2.1049 1.2463 1.2792 1.2960 2.4678 2.6097 1.3558 1.4380 1.6890 1.8863 1.4506 1.5363 3.8153 2.5764 2.6703 1.7843 1.3817 1.9673 1.3782 2.6967 3.3702 1.8016 1.8003 2.0144 1.3184 1.6739 2.6149 1.4147 1.2945 1.2369 1.8221 2.0439 1.0610 1.2046 1.1898 1.1147 1.0637 1.2818 1.0610 1.0831 1.2254 1.0952 1.1120 1.0578 1.0538 3.8059 4.5219 8.7854 8.2150 4.8272 7.5619 6.3930 12.6323 1.0302 1.0298 1.0331 1.0363 1.0600 1.0641 1.0305 1.0855 1.0996 1.1014 1.1052 1.1051 1.0998 1.0986 1.0995 1.0871 1.1029 1.0860 1.1037 1.1028 1.0912 1.1053 1.1049 1.0783
irintensity: 4.1923 3.8909 3.5461 0.1139 0.9012 6.4662 9.1268 1.2986 1.6598 2.1638 1.9882 7.5948 3.5559 3.9613 4.0906 1.9480 0.5667 0.9161 1.6769 6.1608 3.1642 0.2037 2.8169 6.0744 3.4005 5.0707 14.0346 11.4847 3.0785 3.7777 9.6231 1.1318 2.8942 2.1280 2.5401 5.4802 3.3135 0.6459 5.1567 6.9317 2.7757 3.1486 0.8379 11.0695 23.3043 22.7725 33.0700 25.6966 1.4708 7.2914 6.0290 2.2378 0.1680 4.5453 17.3219 5.8218 3.5821 22.8653 8.3812 3.7723 2.5587 10.4454 8.8483 9.7141 16.3198 5.2805 7.3990 10.8710 53.9373 5.3899 21.5655 5.2373 34.7060 4.1975 48.3490 67.1709 23.1868 11.3039 150.0143 7.1545 46.4851 6.2176 21.2592 3.3415 15.5178 4.5198 10.6402 17.8335 4.8208 11.9933 24.9546 57.6567 14.4436 79.1373 393.0247 50.5925 13.9716 20.1991 6.4529 53.3856 15.9291 89.7880 42.9401 62.9350 56.9676 56.2933 57.3318 1.4369 99.5316 150.4525 28.5816 10.6851 41.3955 97.3981 30.3783 11.7330 55.7506 23.6772 8.9287 177.1115 0.3931 49.4090 37.1596 18.3583 19.0417 10.0328 32.9257 183.6533 65.0665 6.4103 46.1141 24.6644 93.5545 169.7521 38.2325 49.6327 58.9589 80.0192 12.0031 25.5376 11.6411 83.7219 3.0077 23.8024 13.3892 25.4276 17.2272 18.6910 8.7022 27.1128 1.5678 40.2526 6.3469 19.0189 15.1013 6.7722 9.7339 9.2179 24.8117
temp: 298.150 k
press: 1.00000 atm
elementType: 8 8 8 8 8 8 7 7 6 6 6 6 6 6 6 6 6 6 6 6 6 6 6 6 6 6 6 6 6 6 6 1 1 1 1 1 1 1 1 1 1 1 1 1 1 1 1 1 1 1 1 1 1 1 1
symmnumber: 1
zpe: 1118886.0 jmol-1
zpe.correction: 0.426161 hartree
zpe.thermalcorrener: 0.458361 hartree
zpe.thermalcorrenthalpy: 0.459305 hartree
zpe.thermalcorrgfe: 0.359677 hartree
zpe.sumelectzpe: -1449.334514 hartree
zpe.sumelectthermal: -1449.302314 hartree
zpe.sumelectthermalent: -1449.301370 hartree
zpe.sumelectthermalfe: -1449.400998 hartree
dipole: -3.5287 -5.6926 1.6579
dipole: 6.8997
quadrupole: -188.9057 -180.6437 -187.2845
quadrupole: -0.1077 -38.2574 -3.5883
quadrupole: -3.2945 4.9676 -1.6732 -0.1077 -38.2574 -3.5883
hfenergy: -1449.760675 hartree
pointgroup: C01 [X(C23H24N2O6)]
dipole: 1.1455199 -2.2922073 -0.8957807 debye
polarizability: 460.201069|1.0802191|267.8603461|-2.5428403|24.2302847|234.3759204 unknown
InChI: InChI=1S/C23H24N2O6/c1-12(26)25-17-8-6-14-16(11-24)21(29-3)23(31-5)22(30-4)20(14)13-7-9-19(28-2)18(27)10-15(13)17/h7,9-10,17,25H,6,8H2,1-5H3
charge 0 multiplicity 1
55 atoms
O  0.36186 -2.009752 -1.41722
O  4.726782 -0.855481 0.5481
O  3.16831 -2.323354 -1.415421
O  -5.413321 -1.602078 0.869392
O  -5.328766 1.142474 0.091806
O  -1.190745 3.601261 -2.089819
N  0.211521 2.273229 -0.788533
N  4.190331 1.519943 3.047487
C  -0.700114 2.268129 0.37626
C  0.064385 2.490979 1.715199
C  0.600127 1.194388 2.38737
C  -1.621084 1.022343 0.420213
C  1.284716 0.275321 1.394177
C  0.484004 -0.426981 0.446028
C  -1.012768 -0.295005 0.459556
C  2.704544 0.147936 1.359396
C  1.13573 -1.274367 -0.497605
C  -2.984971 1.318449 0.39052
C  -1.727958 -1.501841 0.536666
C  3.348697 -0.715102 0.417822
C  2.549244 -1.444622 -0.499175
C  -4.224213 0.540362 0.371361
C  -0.105931 2.958916 -1.955129
C  -3.11599 -1.770088 0.660422
C  -4.227471 -0.918129 0.668267
C  3.525911 0.885828 2.281118
C  0.946943 2.895769 -3.059298
C  0.496153 -1.576698 -2.832026
C  5.579437 -0.798834 -0.664971
C  2.889079 -3.762684 -1.16446
C  -6.684358 -0.937954 1.256221
H  -1.347068 3.145988 0.206617
H  -0.618763 2.988108 2.428804
H  0.896707 3.1937 1.520792
H  1.28553 1.472824 3.205817
H  -0.252077 0.65525 2.841858
H  1.098082 1.772737 -0.723976
H  -3.234676 2.38324 0.278163
H  -1.108255 -2.405515 0.549948
H  -3.38155 -2.82681 0.793735
H  1.805683 2.245447 -2.816061
H  1.318878 3.915535 -3.260344
H  0.471875 2.535591 -3.9879
H  -0.133267 -2.270296 -3.408574
H  0.115893 -0.544335 -2.942336
H  1.549116 -1.645036 -3.158223
H  5.295882 -1.58346 -1.38298
H  5.494448 0.200039 -1.131807
H  6.601204 -0.950166 -0.288312
H  3.433158 -4.305072 -1.952153
H  3.270657 -4.053223 -0.168724
H  1.805553 -3.959276 -1.236952
H  -7.352418 -1.783146 1.482708
H  -6.535324 -0.311728 2.152547
H  -7.062451 -0.31325 0.436428
