program: Gaussian 09
title: 000100063
version: EM64L-G09RevD.01
frameworkgroup: C1[X(C10H14N2O2S)]
method: RPBEPBE
basis: SDD
operation: Freq
keyword: #p
keyword: freq=noraman
keyword: PBEPBE/SDD
title: #p freq=noraman PBEPBE/SDD
converged: YES YES NO NO
title: Mulliken charges:
elementType: S O O N N C C C C C C C C C C H H H H H H H H H H H H H H
charge: 0.152701 -0.425086 -0.240733 -0.630010 -0.009611 -0.481172 -0.680588 -0.700356 -0.089491 0.494950 -0.372989 -0.342097 0.227632 -0.326174 -0.340572 0.223110 0.229822 0.293402 0.269279 0.260510 0.276691 0.257199 0.233568 0.273381 0.308036 0.281912 0.236420 0.235710 0.384556
chargesum: 0.00000
title: Mulliken charges with hydrogens summed into heavy atoms:
elementType: S O O N N C C C C C C C C C C
charge: 0.152701 -0.040530 -0.240733 -0.040062 -0.009611 -0.028240 -0.117907 -0.163155 0.167708 0.494950 -0.139421 -0.068716 0.227632 -0.089754 -0.104862
polarizability: 1.98046747e+02 -1.49773993e-01 1.38261562e+02 1.74873733e+00 1.20336694e+01 9.16834856e+01
1716.lowfreq: -12.7752 -6.6351 -3.2445 -0.0014 -0.0009 -0.0008 13.7013 27.7450 40.5712
frequency: 12.6801 27.7144 40.4986 49.0262 62.2705 87.0818 127.7376 167.0577 206.0282 231.5404 253.1766 265.1675 276.2172 304.2737 345.2974 370.9727 381.9018 468.8352 509.2534 531.2691 555.1538 583.0111 630.9652 662.9922 674.9231 687.3990 727.8496 747.6915 755.3036 766.9744 803.1092 846.2407 895.7487 901.1804 959.5270 965.0018 974.7863 985.3600 996.8070 1028.3138 1049.0066 1065.0297 1080.1720 1094.7606 1139.1178 1163.0004 1205.6498 1215.6440 1224.4838 1246.9558 1251.4484 1263.6830 1273.6275 1293.5189 1308.4854 1319.7639 1341.1781 1384.3248 1405.3445 1427.2390 1435.2969 1465.3172 1469.0769 1556.0052 1587.6661 1628.8347 1669.3983 2877.9127 3007.7239 3033.6790 3037.2731 3068.2991 3112.9765 3122.1993 3124.1760 3126.1540 3146.2009 3155.2934 3469.0961 3515.6532 3601.6319
redmass: 4.8670 6.0955 4.8237 6.1268 4.0666 5.1033 4.0242 3.8098 4.9138 4.7447 1.3810 3.1856 3.7512 2.1711 2.7060 2.5164 4.3203 3.9516 3.8782 3.8570 5.8155 1.3321 1.4306 6.9107 3.4235 4.2488 2.4529 1.8015 3.2331 2.3672 2.0919 2.0531 1.2612 2.0221 6.6095 1.4334 1.6551 1.4541 3.3651 4.5119 2.2984 2.2321 1.5766 2.3189 1.1178 1.1269 1.3934 1.6522 1.6901 1.1679 1.2595 1.7093 1.2495 1.3906 3.0951 1.6286 1.2500 1.8914 2.0414 1.0976 1.0827 1.8675 1.1405 6.7389 5.5848 1.0930 9.0649 1.0798 1.0599 1.0597 1.0604 1.1005 1.1048 1.0880 1.1048 1.0892 1.0968 1.0979 1.0448 1.0641 1.0987
irintensity: 1.3873 0.5646 0.0837 0.3892 0.7740 3.0648 2.8738 3.8438 0.4739 6.2221 25.9727 12.3877 0.6847 10.4972 3.0691 0.1716 10.7274 38.8636 19.8422 7.2406 12.3864 30.8877 316.4813 0.6725 64.4586 8.4455 16.8135 1.7945 1.6579 5.5033 25.0090 30.6915 0.3418 4.0496 6.5692 0.2461 2.2692 0.2120 28.4250 7.1031 308.1636 5.0183 3.3343 21.2904 1.7356 3.1163 0.7940 0.4461 1.7807 8.5739 4.5378 18.3402 4.7758 3.2998 8.8117 5.8442 1.8614 17.9087 16.1432 9.9223 20.6847 12.9166 9.6286 10.3491 68.1725 56.8840 261.5716 41.8672 16.9220 23.1142 16.0540 13.3545 5.6681 13.2970 5.8197 18.0955 35.8467 3.3374 4.5343 26.7014 6.6441
temp: 298.150 k
press: 1.00000 atm
elementType: 16 8 8 7 7 6 6 6 6 6 6 6 6 6 6 1 1 1 1 1 1 1 1 1 1 1 1 1 1
symmnumber: 1
zpe: 603089.2 jmol-1
zpe.correction: 0.229705 hartree
zpe.thermalcorrener: 0.245551 hartree
zpe.thermalcorrenthalpy: 0.246496 hartree
zpe.thermalcorrgfe: 0.183086 hartree
zpe.sumelectzpe: -1046.326505 hartree
zpe.sumelectthermal: -1046.310658 hartree
zpe.sumelectthermalent: -1046.309714 hartree
zpe.sumelectthermalfe: -1046.373124 hartree
dipole: 4.6117 -0.4047 1.4958
dipole: 4.8651
quadrupole: -100.6811 -91.8678 -99.3975
quadrupole: -11.5013 -2.3456 -2.4857
quadrupole: -3.3656 5.4477 -2.0821 -11.5013 -2.3456 -2.4857
hfenergy: -1046.5562099 hartree
pointgroup: C01 [X(C10H14N2O2S1)]
dipole: 1.8220203 -0.1377528 0.5700061 debye
polarizability: 196.7174973|8.4232532|121.6873171|2.9612358|26.1351406|109.58698 unknown
InChI: InChI=1S/C10H14N2O2S/c11-9(10(13)14)7-15-6-3-8-1-4-12-5-2-8/h1-2,4-5,9,13H,3,6-7,11H2
charge 0 multiplicity 1
29 atoms
S  1.220962 2.336584 1.111065
O  3.312988 -1.866737 0.06961
O  1.446022 -0.759238 -0.736596
N  4.661397 0.505838 -0.352239
N  -4.425129 -1.146434 -1.09058
C  -1.009549 0.533858 1.099426
C  -0.344141 1.656569 0.268074
C  2.59678 1.836528 -0.090152
C  3.328258 0.529739 0.287161
C  -2.200676 -0.056941 0.359846
C  -3.537355 0.243313 0.72217
C  -2.006632 -0.917562 -0.753334
C  2.56748 -0.709562 -0.190667
C  -4.603252 -0.316273 -0.02001
C  -3.131151 -1.430547 -1.435302
H  -1.322622 0.935417 2.080771
H  -0.253338 -0.24895 1.285959
H  -0.03328 1.273626 -0.715577
H  -1.02573 2.512421 0.130359
H  3.317229 2.671393 -0.048026
H  2.187023 1.786207 -1.111142
H  3.358094 0.460483 1.402609
H  -3.749685 0.900011 1.573742
H  -0.993308 -1.181326 -1.075468
H  5.137413 -0.399226 -0.293395
H  5.258872 1.293571 -0.086448
H  -5.644742 -0.099622 0.245389
H  -3.007165 -2.099226 -2.295242
H  2.819739 -2.667414 -0.257104
