program: Gaussian 09
title: 000100054
version: EM64L-G09RevD.01
frameworkgroup: C1[X(C12H12N2O3)]
method: RPBEPBE
basis: SDD
operation: Freq
keyword: #p
keyword: freq=noraman
keyword: PBEPBE/SDD
title: #p freq=noraman PBEPBE/SDD
converged: NO YES NO NO
title: Mulliken charges:
elementType: O O O N N C C C C C C C C C C C C H H H H H H H H H H H H
charge: -0.437690 -0.227102 -0.221305 -0.372583 0.010994 0.131491 -0.530053 -0.514033 -0.102313 -0.461689 0.440521 0.091434 0.020792 -0.308825 0.056070 -0.420452 -0.349434 0.254963 0.259219 0.234033 0.264437 0.252588 0.227877 0.216840 0.356706 0.246763 0.343256 0.288308 0.249185
chargesum: 0.00000
title: Mulliken charges with hydrogens summed into heavy atoms:
elementType: O O O N N C C C C C C C C C C C C
charge: -0.094434 -0.227102 -0.221305 -0.015877 0.010994 0.131491 -0.015871 -0.015562 0.150275 -0.016971 0.440521 0.091434 0.020792 -0.062062 0.056070 -0.132144 -0.100249
polarizability: 1.89758151e+02 1.50672026e+00 1.58243024e+02 9.78724488e+00 -2.69602691e+00 8.95031399e+01
1716.lowfreq: -13.4780 -5.3293 -0.0006 0.0005 0.0007 11.1822 20.5206 46.9763 85.7343
frequency: 19.1957 46.3733 85.7195 123.4157 146.4605 168.6589 225.1962 245.0960 253.4764 288.7077 293.6852 322.6594 359.6267 369.2382 389.7815 425.6117 455.1285 480.2500 526.5394 569.6017 607.4697 639.0215 661.4093 678.3368 699.6804 738.9865 780.6818 784.7916 801.0120 814.9271 846.9952 851.8994 885.0825 953.7965 959.3707 969.3126 977.8726 986.9233 1011.7490 1025.6351 1031.1987 1052.2298 1081.8150 1120.9395 1151.8809 1171.7182 1176.6394 1195.0277 1248.4324 1252.5817 1264.6293 1272.4165 1280.4127 1296.7816 1313.7477 1319.1643 1331.1206 1343.1083 1372.1291 1387.9631 1412.1904 1460.2680 1464.2145 1468.0104 1481.3727 1547.4237 1575.7429 1618.6400 1636.2313 2996.0811 3004.6300 3021.6156 3028.7982 3065.2861 3091.7959 3094.9424 3134.5984 3153.6937 3159.1732 3484.0979 3578.1134
redmass: 6.7563 3.6710 4.7163 3.8207 9.2451 4.3883 5.1685 2.8985 1.1887 3.4897 4.2408 5.6484 5.3901 4.4326 4.0288 9.6455 2.1794 6.3406 4.0549 3.7457 5.5518 4.9362 6.5588 3.1734 4.9048 4.5923 2.6861 4.5133 2.2957 1.7135 1.9422 1.3878 2.7233 1.4813 3.1453 1.7617 1.6095 2.8905 2.9046 3.5950 2.6012 2.2118 2.5617 2.9069 1.7501 1.8413 1.4035 1.3566 1.9904 1.5210 2.3549 1.6287 1.5215 1.6029 1.9675 2.4219 1.6597 2.0530 1.8022 1.4770 2.8184 2.1337 1.0901 1.0932 1.1040 8.0898 6.6314 9.2200 5.7735 1.0659 1.0804 1.0610 1.0618 1.1022 1.1043 1.1049 1.0877 1.0925 1.0977 1.0760 1.0665
irintensity: 0.0194 1.0330 0.3134 3.0655 7.9569 0.1043 1.0292 19.0892 133.0633 0.3433 17.6380 8.8407 5.1905 6.0214 0.3632 7.3036 9.2656 6.0226 5.1597 19.6673 8.8860 2.7513 15.2734 9.8913 0.4729 17.3665 6.0098 11.6668 1.5362 109.2677 1.6972 15.9416 2.6330 7.4788 2.5296 11.9207 3.0897 48.0226 46.6880 28.9372 26.0834 5.0012 1.6613 16.6012 6.2947 18.2258 20.5277 10.7760 36.4530 21.5911 79.1232 30.2470 54.6911 98.5997 17.3128 59.4274 35.1187 44.5496 2.5438 5.8817 23.0702 2.3763 2.7702 22.2655 9.7518 6.2800 146.9791 109.9986 423.6543 16.7470 22.8435 15.5440 17.5778 25.6200 5.0830 29.5125 5.2086 8.8340 10.6495 49.8143 7.3894
temp: 298.150 k
press: 1.00000 atm
elementType: 8 8 8 7 7 6 6 6 6 6 6 6 6 6 6 6 6 1 1 1 1 1 1 1 1 1 1 1 1
symmnumber: 1
zpe: 589820.2 jmol-1
zpe.correction: 0.224651 hartree
zpe.thermalcorrener: 0.238773 hartree
zpe.thermalcorrenthalpy: 0.239718 hartree
zpe.thermalcorrgfe: 0.182786 hartree
zpe.sumelectzpe: -798.444756 hartree
zpe.sumelectthermal: -798.430633 hartree
zpe.sumelectthermalent: -798.429689 hartree
zpe.sumelectthermalfe: -798.486621 hartree
dipole: 4.1271 -1.5514 1.6769
dipole: 4.7171
quadrupole: -107.4183 -102.9816 -100.7478
quadrupole: -3.2371 1.7281 -3.8794
quadrupole: -3.7024 0.7343 2.9681 -3.2371 1.7281 -3.8794
hfenergy: -798.6694061 hartree
pointgroup: C01 [X(C12H12N2O3)]
dipole: 1.5896333 -0.6922587 0.6618635 debye
polarizability: 189.865232|-0.1378534|158.1206062|9.436444|-3.7322546|89.5184771 unknown
InChI: InChI=1S/C12H12N2O3/c15-7-1-3-12(5-7)9-2-4-13-6-8(9)10(16)14-11(12)17/h2,4,6-7,14-15H,1,3,5H2
charge 0 multiplicity 1
29 atoms
O  3.913463 -1.10449 -1.351596
O  1.625568 2.450829 0.431216
O  -2.908058 2.259712 -0.442392
N  -0.621032 2.260086 -0.048046
N  -3.073488 -1.977263 -0.081911
C  0.760064 0.163338 0.230961
C  1.688485 -0.211669 -0.995946
C  1.612627 -0.277239 1.503479
C  3.115117 -0.293001 -0.422981
C  2.904061 -0.941361 0.965211
C  -0.57699 -0.56258 0.13673
C  0.632978 1.696522 0.232421
C  -1.802784 0.117696 -0.088948
C  -0.642737 -1.974683 0.248553
C  -1.859203 1.596532 -0.217775
C  -3.011018 -0.624179 -0.190646
C  -1.885766 -2.628447 0.137011
H  1.60187 0.50358 -1.830229
H  1.419063 -1.212836 -1.378496
H  1.029552 -0.948719 2.155333
H  1.864677 0.624742 2.085455
H  3.543389 0.722901 -0.311284
H  3.760117 -0.794583 1.647299
H  2.767629 -2.029976 0.815047
H  -0.651896 3.286577 -0.095827
H  0.263997 -2.564439 0.418812
H  4.872008 -1.017681 -1.121864
H  -3.951685 -0.091813 -0.365286
H  -1.953407 -3.718655 0.221602
