program: Gaussian 09
title: 000100053
version: EM64L-G09RevD.01
frameworkgroup: C1[X(C10H14N6O3)]
method: RPBEPBE
basis: SDD
operation: Freq
keyword: #p
keyword: freq=noraman
keyword: PBEPBE/SDD
title: #p freq=noraman PBEPBE/SDD
converged: YES YES NO NO
title: Mulliken charges:
elementType: O O O N N N N N N C C C C C C C C C C H H H H H H H H H H H H H H
charge: -0.254412 -0.449897 -0.476403 -0.157033 -0.591571 -0.084973 -0.056956 -0.061187 -0.611428 -0.192239 -0.091227 -0.131394 -0.072366 -0.443082 0.213484 -0.240626 -0.112314 0.165832 -0.366325 0.288050 0.229269 0.237256 0.214780 0.217883 0.341824 0.286200 0.285596 0.387628 0.262474 0.349587 0.240513 0.330549 0.342506
chargesum: 0.00000
title: Mulliken charges with hydrogens summed into heavy atoms:
elementType: O O O N N N N N N C C C C C C C C C C
charge: -0.254412 -0.062269 -0.126815 -0.157033 -0.019774 -0.084973 -0.056956 -0.061187 0.061627 0.095811 0.138042 0.105862 0.142414 0.116625 0.213484 0.021848 -0.112314 0.165832 -0.125812
polarizability: 2.05373804e+02 6.02632889e+00 1.72319719e+02 1.33483978e+01 -1.75138044e+00 9.34471408e+01
1716.lowfreq: -6.6607 -0.0009 -0.0008 -0.0008 2.9830 9.5082 23.3795 51.6794 65.5019
frequency: 23.3249 51.6270 65.5009 90.4267 122.8944 138.2936 158.8443 184.2160 198.3233 205.5171 223.4010 241.9333 272.6908 282.1106 318.2414 329.2210 354.6302 370.8570 417.3853 455.5250 464.4851 504.7303 513.7095 536.3112 546.4699 562.1595 570.5571 601.4075 644.4688 665.3343 672.6911 694.1665 726.3338 732.0023 785.9869 792.0769 795.3616 816.6007 859.9378 886.0123 895.5698 929.1409 932.9429 956.7531 960.6570 986.1554 1011.7176 1029.7417 1043.5754 1086.2123 1109.7358 1151.5734 1155.8143 1164.7711 1171.1365 1182.8988 1216.7877 1240.1836 1258.6503 1264.9327 1279.1352 1304.9351 1309.7585 1315.3334 1319.6496 1328.1419 1337.9482 1349.1255 1373.7730 1384.2235 1396.9599 1405.6889 1443.3073 1456.5050 1495.3792 1537.0166 1578.6255 1630.0552 1640.1547 2968.2063 2987.3363 3004.1255 3010.6821 3070.0074 3082.6311 3157.9671 3220.1110 3431.0502 3498.2292 3541.5239 3575.5402 3633.3916 3697.3850
redmass: 5.7792 5.8072 5.3658 5.4977 6.1909 4.9759 3.1136 1.7429 4.7172 2.7559 4.0214 3.9759 4.7926 2.8740 1.8002 3.1587 2.7023 3.8414 4.3804 4.7134 1.5402 1.2352 8.7605 4.4517 1.0467 3.9906 4.1555 6.2827 4.5293 9.0113 1.0877 7.2250 3.1994 5.8941 3.3238 4.6953 4.7054 2.2993 8.1178 2.7634 3.9404 1.4363 5.1387 2.0726 2.5197 3.0381 3.8531 3.3137 2.1467 1.7100 2.0232 2.8203 1.5828 2.4279 1.9405 1.9277 3.1714 1.3813 2.6944 1.2801 1.3654 4.4708 1.5500 2.3122 1.4515 1.3284 2.0449 1.5768 2.0826 1.4590 1.7919 1.2770 2.6190 3.7154 1.0678 5.5144 1.9521 2.7648 1.0963 1.0854 1.0598 1.0851 1.0885 1.1114 1.0877 1.0918 1.0976 1.0655 1.0451 1.0441 1.0667 1.0997 1.1057
irintensity: 1.4798 2.5009 0.6804 3.9514 0.7983 3.0625 13.6655 47.9003 2.7263 14.4647 4.0939 15.0280 6.9888 14.2754 38.2343 50.6229 74.1174 23.7510 9.6111 23.5787 239.0058 264.7910 6.8833 11.6708 4.4009 3.1611 8.5974 5.7596 37.9770 1.4183 194.0417 6.4939 8.1771 15.5107 38.1183 10.2502 62.4109 5.0719 10.7072 6.6594 33.7042 9.7356 87.8712 31.9395 8.9272 13.3605 5.0270 147.8022 12.9625 10.4965 31.0290 7.5122 24.8543 20.3462 53.9308 65.9889 66.9544 16.7665 8.0897 1.8105 6.8192 47.0206 5.4533 18.2608 14.6475 6.5160 109.0574 86.6714 4.2722 28.5037 8.0219 3.0940 41.9824 20.2618 12.7092 79.6003 29.9390 621.5399 46.0121 53.9495 127.6563 54.4466 73.9850 36.9872 6.0443 16.1851 0.6009 92.1766 6.3170 121.5128 7.7153 6.8131 48.2962
temp: 298.150 k
press: 1.00000 atm
elementType: 8 8 8 7 7 7 7 7 7 6 6 6 6 6 6 6 6 6 6 1 1 1 1 1 1 1 1 1 1 1 1 1 1
symmnumber: 1
zpe: 672233.2 jmol-1
zpe.correction: 0.256040 hartree
zpe.thermalcorrener: 0.273249 hartree
zpe.thermalcorrenthalpy: 0.274194 hartree
zpe.thermalcorrgfe: 0.211120 hartree
zpe.sumelectzpe: -942.194939 hartree
zpe.sumelectthermal: -942.177729 hartree
zpe.sumelectthermalent: -942.176785 hartree
zpe.sumelectthermalfe: -942.239859 hartree
dipole: -3.3963 -2.7419 -1.0134
dipole: 4.4811
quadrupole: -84.5400 -102.5872 -119.1077
quadrupole: -3.0897 6.9413 -0.3880
quadrupole: 17.5383 -0.5089 -17.0294 -3.0897 6.9413 -0.3880
hfenergy: -942.4509789 hartree
pointgroup: C01 [X(C10H14N6O3)]
dipole: -1.2029868 -1.2229727 -0.4065479 debye
polarizability: 203.737738|9.5415531|174.1842935|12.5885698|1.0015877|93.2186321 unknown
InChI: InChI=1S/C10H14N6O3/c11-5-7(18)4(1-17)19-10(5)16-3-15-6-8(12)13-2-14-9(6)16/h2-5,7,10,17-18H,1,11-12H2
charge 0 multiplicity 1
33 atoms
O  -1.789412 -0.502729 -1.44111
O  -1.687412 0.408924 1.697258
O  -3.14681 2.430652 0.475799
N  0.355483 -1.146152 -0.431517
N  -2.92702 -2.80984 0.452326
N  2.559024 -1.686815 -0.015794
N  0.589854 1.36488 -0.36675
N  2.906709 2.060775 0.093374
N  4.655119 0.503858 0.425261
C  -1.929948 -1.753173 0.626969
C  -1.07349 -1.502141 -0.670942
C  -2.59722 -0.375547 0.872337
C  -2.793495 0.195422 -0.562203
C  -2.552336 1.713698 -0.680917
C  1.03514 0.076869 -0.276199
C  1.326329 -2.153441 -0.26938
C  2.38997 -0.292492 -0.021099
C  3.333754 0.758146 0.170293
C  1.581675 2.280672 -0.170185
H  -1.288045 -1.994878 1.489084
H  -1.040636 -2.428185 -1.276253
H  -3.570233 -0.522956 1.379226
H  -3.793678 -0.094296 -0.9462
H  -2.946631 2.11161 -1.634191
H  -1.464742 1.887038 -0.616719
H  -2.626531 -3.76063 0.666542
H  -3.529021 -2.738788 -0.370844
H  -2.023236 1.349509 1.686805
H  1.070769 -3.208484 -0.353327
H  -4.13213 2.462498 0.394451
H  1.282299 3.331734 -0.229935
H  5.292267 1.28663 0.554932
H  4.982033 -0.45807 0.484112
