program: Gaussian 09
title: 000100052
version: EM64L-G09RevD.01
frameworkgroup: C1[X(C10H13IN2O4)]
method: RPBEPBE
basis: SDD
operation: Freq
keyword: #p
keyword: freq=noraman
keyword: PBEPBE/SDD
title: #p freq=noraman PBEPBE/SDD
converged: YES YES NO NO
title: Mulliken charges:
elementType: I O O O O N N C C C C C C C C C C H H H H H H H H H H H H H
charge: 0.165810 -0.466568 -0.428647 -0.252042 -0.220117 -0.184221 -0.417675 -0.078928 0.000334 -0.555558 -0.098285 -0.545511 -0.418037 0.222685 0.003395 -0.489228 0.237927 0.221359 0.292459 0.235469 0.261652 0.246217 0.227603 0.254768 0.197336 0.265653 0.349806 0.275822 0.328906 0.367616
chargesum: 0.00000
title: Mulliken charges with hydrogens summed into heavy atoms:
elementType: I O O O O N N C C C C C C C C C C
charge: 0.165810 -0.116762 -0.099741 -0.252042 -0.220117 -0.184221 -0.050059 0.142431 0.292793 -0.058437 0.147932 -0.063140 0.044951 0.222685 0.279217 -0.489228 0.237927
polarizability: 2.09206112e+02 -1.80006079e+01 1.69139643e+02 -1.85382619e+00 -3.58554967e+00 9.12259344e+01
1716.lowfreq: -7.0723 -2.5779 -0.0007 -0.0007 -0.0006 8.0781 26.3366 34.9902 57.7035
frequency: 25.5565 34.7530 57.6680 80.5203 92.9349 112.1314 138.9122 165.7775 184.1878 197.4577 224.0937 244.0333 249.2111 251.9326 265.1756 319.9449 347.7994 384.7291 404.8505 434.0255 467.4790 510.6436 540.5849 579.9241 599.0930 651.0211 672.6128 692.3856 712.2575 747.7350 777.1893 778.1636 834.3519 857.5446 895.0896 902.7586 917.0376 947.9307 970.8552 977.0766 987.5861 1027.8327 1063.4576 1082.3996 1097.9230 1112.5835 1128.0691 1146.7097 1174.1152 1195.9545 1218.3613 1245.8030 1253.9397 1264.2120 1296.4415 1304.0141 1309.4846 1324.0550 1335.9986 1348.7244 1351.5470 1365.8104 1372.5280 1380.8269 1417.6708 1461.7725 1466.0591 1473.3394 1593.0827 1636.2014 1655.1635 2950.2912 2962.1255 2996.8122 3015.8002 3023.8744 3067.9172 3074.6954 3094.5103 3104.6322 3170.7481 3521.2773 3556.4183 3586.4928
redmass: 7.1350 5.7513 5.9891 8.0052 5.0596 4.4516 3.9687 6.7844 9.7482 4.8173 4.0830 2.5292 3.7918 1.8673 2.4258 1.2578 4.6874 11.0328 2.7439 3.9911 3.7429 3.4034 2.9109 7.6799 4.7368 3.5374 4.2163 2.0418 10.9063 8.6476 3.1823 2.5879 3.3597 2.5331 1.6777 1.5162 2.5697 2.1791 3.4217 2.1240 2.9896 1.7647 4.1531 2.3776 2.2365 2.3582 1.4887 1.6395 2.8174 1.4563 1.4290 1.8567 1.8325 1.2451 1.7366 1.2780 1.7872 1.3011 1.3061 1.5137 1.5184 1.6438 1.6335 1.2627 2.1307 1.0766 1.0895 1.0936 6.3332 11.5802 6.1345 1.0820 1.0704 1.0643 1.0628 1.0849 1.0973 1.1029 1.0897 1.0946 1.0933 1.0769 1.0663 1.0665
irintensity: 1.0961 0.8071 1.3020 1.6571 5.8632 0.7489 4.4508 0.7228 2.0729 11.2497 26.1157 22.2819 7.5970 116.7315 36.5559 134.4878 6.3183 22.4303 4.8903 14.1853 6.3552 4.9037 25.3564 17.8430 4.4869 5.9725 10.6335 7.7394 0.6933 4.2665 40.6418 90.6626 14.1139 32.6670 25.2263 10.0627 16.1682 8.0110 66.5277 28.4247 64.8616 5.7115 9.2080 23.5386 16.1318 13.4404 23.2466 21.9712 1.0237 21.3037 16.5195 37.1202 162.6319 13.8350 58.3499 15.2333 38.0286 5.7647 0.3415 17.2493 4.0527 12.9662 3.7600 15.1425 70.4556 8.3000 16.0040 6.2082 15.9545 375.8360 692.3695 27.7402 57.2880 14.3942 42.1658 35.7948 25.3078 6.2222 14.4485 8.0225 1.5455 67.4497 6.7843 10.7525
temp: 298.150 k
press: 1.00000 atm
elementType: 53 8 8 8 8 7 7 6 6 6 6 6 6 6 6 6 6 1 1 1 1 1 1 1 1 1 1 1 1 1
symmnumber: 1
zpe: 600912.3 jmol-1
zpe.correction: 0.228875 hartree
zpe.thermalcorrener: 0.245663 hartree
zpe.thermalcorrenthalpy: 0.246607 hartree
zpe.thermalcorrgfe: 0.181931 hartree
zpe.sumelectzpe: -809.486133 hartree
zpe.sumelectthermal: -809.469346 hartree
zpe.sumelectthermalent: -809.468402 hartree
zpe.sumelectthermalfe: -809.533078 hartree
dipole: -2.7044 -2.7142 1.3323
dipole: 4.0566
quadrupole: -145.4030 -117.3223 -109.0329
quadrupole: -7.5274 -5.1475 3.4499
quadrupole: -21.4836 6.5971 14.8865 -7.5274 -5.1475 3.4499
hfenergy: -809.7150088 hartree
pointgroup: C01 [X(C10H13I1N2O4)]
dipole: 1.3752278 0.6356822 0.5017799 debye
polarizability: 193.3235727|-26.5370095|184.8998494|-0.4151504|5.6116938|91.3482673 unknown
InChI: InChI=1S/C10H13IN2O4/c11-7-3-13(10(17)12-9(7)16)6-1-5(4-14)8(15)2-6/h3,5-6,8,12,14-15H,1-2,4H2
charge 0 multiplicity 1
30 atoms
I  -3.054071 3.205485 0.309744
O  3.504624 -1.485262 0.536022
O  4.872804 1.655168 -0.295359
O  -1.437651 -2.821885 -0.249408
O  -4.836432 0.377826 -0.026389
N  -0.801319 -0.557417 -0.028326
N  -3.085557 -1.163513 -0.138314
C  2.609981 0.60859 -0.274249
C  0.648782 -0.913073 -0.020801
C  1.498014 -0.126011 -1.079439
C  2.779997 -0.279349 0.982487
C  1.326267 -0.634993 1.357637
C  3.909497 0.84284 -1.059256
C  -1.753177 -1.606435 -0.147181
C  -1.201332 0.767146 0.099567
C  -2.519478 1.161962 0.108978
C  -3.595221 0.167158 -0.018624
H  2.225231 1.591257 0.07726
H  0.672272 -1.991356 -0.238565
H  0.879236 0.564502 -1.679376
H  1.958412 -0.846127 -1.777538
H  3.334965 0.230863 1.792593
H  0.85097 0.230664 1.859285
H  1.251868 -1.4997 2.039406
H  3.687946 1.310047 -2.042647
H  4.420569 -0.118678 -1.220213
H  3.700157 -2.058674 1.317706
H  -0.392041 1.495533 0.191195
H  4.530629 2.58264 -0.229443
H  -3.791241 -1.902508 -0.226753
