program: Gaussian 09
title: 000100051
version: EM64L-G09RevD.01
frameworkgroup: C1[X(C17H20N2O6)]
method: RPBEPBE
basis: SDD
operation: Freq
keyword: #p
keyword: freq=noraman
keyword: PBEPBE/SDD
title: #p freq=noraman PBEPBE/SDD
converged: YES YES NO NO
title: Mulliken charges:
elementType: O O O O O O N N C C C C C C C C C C C C C C C C C H H H H H H H H H H H H H H H H H H H H
charge: -0.207337 -0.173825 -0.286815 -0.171147 -0.193717 -0.304714 -0.395064 -0.123153 -0.052485 -0.201910 -0.728823 -0.701818 0.239155 -0.500787 -0.501397 0.214478 0.225678 0.315937 -0.480286 0.477875 -0.364933 -0.391430 -0.223956 -0.225134 -0.231606 0.234824 0.305024 0.220547 0.270365 0.204410 0.218856 0.226873 0.223761 0.346327 0.271838 0.271011 0.270690 0.272275 0.220765 0.245127 0.269897 0.231219 0.228454 0.226051 0.228902
chargesum: 0.00000
title: Mulliken charges with hydrogens summed into heavy atoms:
elementType: O O O O O O N N C C C C C C C C C C C C C C C C C
charge: -0.207337 -0.173825 -0.286815 -0.171147 -0.193717 -0.304714 -0.048737 -0.123153 0.182339 0.103114 -0.033501 -0.032328 0.239155 0.042061 0.041568 0.214478 0.225678 0.315937 -0.014394 0.477875 -0.095036 -0.160211 0.004498 0.000917 -0.002704
polarizability: 2.22711493e+02 -1.87398348e+01 2.36666236e+02 3.11738585e+00 -6.90695245e+00 1.81990215e+02
1716.lowfreq: -9.2768 -3.8661 -0.0003 0.0003 0.0006 5.9594 10.4658 12.1889 20.0595
frequency: 10.0357 11.9675 19.9596 35.7730 41.6285 49.7507 57.2312 58.5369 69.7487 81.8445 87.1862 108.1520 116.5008 136.5154 152.0315 179.7496 204.5569 237.7633 244.5076 266.9165 277.6963 289.8790 305.1471 321.8455 345.2407 368.1573 391.4778 401.4230 403.5837 472.1741 504.0773 521.3137 534.8606 549.9501 552.3146 562.4741 581.0147 593.2696 616.9042 632.8137 641.2033 651.1753 671.4428 698.5447 705.6037 753.3698 755.0723 775.6018 807.8621 815.6680 819.7053 857.7951 871.0134 922.7224 933.3680 944.8750 954.6418 960.5835 981.0775 984.6120 990.3590 991.3285 1000.9773 1005.7695 1017.2127 1027.1035 1029.8294 1067.5159 1084.0652 1091.7104 1124.5618 1147.7025 1166.0815 1170.6561 1173.4582 1186.3027 1190.1901 1204.7769 1209.4153 1222.9818 1231.3137 1239.2661 1254.9890 1292.5003 1293.5763 1295.2274 1323.3504 1331.1285 1336.9641 1351.9932 1383.2520 1385.9848 1406.7053 1438.0058 1442.6294 1453.9341 1461.8037 1465.3228 1472.7619 1483.0125 1485.1819 1488.0854 1493.2828 1594.6927 1615.1664 1648.5892 1661.3043 1697.5169 1726.5971 2974.3223 2982.5333 2999.3587 3020.7973 3030.6670 3036.0593 3039.2132 3067.6546 3077.4701 3082.0877 3083.9648 3085.4186 3102.1297 3109.9066 3118.6807 3128.0889 3139.6801 3150.6778 3165.0321 3576.9816
redmass: 5.6264 5.3735 6.7013 4.0281 6.3121 7.1988 4.3216 4.6455 3.0476 7.2625 1.9618 5.8192 7.6190 5.4487 6.2384 5.4154 1.0555 1.7435 1.9706 4.4374 4.9738 3.6903 9.0753 6.8513 2.8366 6.9989 2.6758 3.3771 2.8768 3.6114 2.6865 5.8796 3.6434 4.0127 2.9124 1.8742 3.7645 5.1354 6.2573 5.9180 3.8542 5.0970 5.7850 6.3552 2.0553 7.5610 2.5863 5.1199 3.8411 3.4616 1.4863 1.2599 4.8573 1.1806 1.5135 2.1665 2.4733 1.6358 1.6459 1.9451 4.8025 3.8841 1.3463 2.1697 5.5493 2.2134 4.4356 1.8905 7.1998 1.5238 2.4790 1.1939 9.1407 2.6183 1.0577 2.2301 1.2166 2.2270 1.1111 2.8408 3.0107 1.1600 1.1947 1.3245 1.9924 1.5710 1.4485 1.2555 1.3553 1.3008 1.2030 7.9782 1.2076 1.0735 2.1795 1.0898 1.1300 1.0534 1.0623 1.7076 2.0652 1.0476 1.1604 6.0853 6.0652 8.8300 12.6140 12.7301 12.5725 1.0366 1.0355 1.0841 1.0829 1.0594 1.0584 1.0630 1.0992 1.1003 1.0990 1.1001 1.1036 1.1019 1.1073 1.0870 1.0872 1.0919 1.0965 1.1016 1.0774
irintensity: 0.0742 0.1740 0.0241 0.2318 0.8329 1.5253 2.2200 3.2778 1.6474 6.3841 0.2118 9.6681 1.0134 0.3044 0.7916 4.3463 0.0928 2.9626 6.4118 10.4262 1.8632 1.3722 2.7770 0.5695 6.8033 17.9387 11.9739 7.3178 0.7657 11.9846 22.8142 12.1490 0.9586 2.0052 2.8585 42.2108 79.8615 7.9118 0.5054 55.8443 9.6108 2.0378 15.0140 21.7273 58.2696 33.6122 53.1776 118.4683 4.5656 9.3330 18.1299 0.6075 64.1628 6.9035 20.0047 21.4379 100.8668 10.4764 28.5495 74.4833 40.1405 89.3340 1.1389 0.3741 4.6119 2.9149 64.7156 54.3103 85.5604 8.2813 17.4923 0.4898 215.6449 12.8051 0.0226 128.8744 2.6433 180.0791 0.1188 24.4642 71.8132 8.6166 22.5327 66.6823 51.6955 9.6498 7.5561 2.0721 14.6653 13.0355 17.0354 0.6687 21.0024 0.9511 9.7369 27.3472 13.5187 9.8937 7.8354 268.1843 112.6187 8.2417 87.0318 2.1100 0.5048 221.1901 557.8441 113.9053 40.2848 17.1635 26.7328 6.8318 20.6179 10.2670 35.1054 1.3533 16.0864 5.3105 62.3089 30.4885 0.0346 4.6556 5.3981 6.3895 2.0656 16.9369 27.1663 21.6804 41.7115
temp: 298.150 k
press: 1.00000 atm
elementType: 8 8 8 8 8 8 7 7 6 6 6 6 6 6 6 6 6 6 6 6 6 6 6 6 6 1 1 1 1 1 1 1 1 1 1 1 1 1 1 1 1 1 1 1 1
symmnumber: 1
zpe: 919502.2 jmol-1
zpe.correction: 0.350220 hartree
zpe.thermalcorrener: 0.375304 hartree
zpe.thermalcorrenthalpy: 0.376248 hartree
zpe.thermalcorrgfe: 0.289708 hartree
zpe.sumelectzpe: -1218.792038 hartree
zpe.sumelectthermal: -1218.766954 hartree
zpe.sumelectthermalent: -1218.766010 hartree
zpe.sumelectthermalfe: -1218.852550 hartree
dipole: -1.8139 -2.0066 -2.2849
dipole: 3.5408
quadrupole: -132.8946 -128.9573 -147.9200
quadrupole: 11.8966 -5.4920 2.0545
quadrupole: 3.6961 7.6333 -11.3294 11.8966 -5.4920 2.0545
hfenergy: -1219.142258 hartree
pointgroup: C01 [X(C17H20N2O6)]
dipole: 0.5659918 -0.641745 1.0992924 debye
polarizability: 223.1509298|19.554876|236.3640213|4.9551336|-0.369816|181.8529917 unknown
InChI: InChI=1S/C17H20N2O6/c1-11(2)15(16(22)25-19-13(20)8-9-14(19)21)18-17(23)24-10-12-6-4-3-5-7-12/h3-7,11,15,18H,8-10H2,1-2H3
charge 0 multiplicity 1
45 atoms
O  1.62967 -0.262268 0.683801
O  2.943239 0.172854 -1.233663
O  -2.335279 1.635597 0.662135
O  1.345264 -3.033427 -0.172228
O  4.1527 0.03294 2.048432
O  -1.661372 1.842245 -1.595297
N  -0.121657 1.637029 0.166717
N  2.547399 -1.317175 0.947443
C  1.918956 3.001567 -0.502604
C  1.061164 1.689788 -0.686166
C  2.443302 3.155038 0.943883
C  1.087044 4.226496 -0.940325
C  1.982676 0.48511 -0.525204
C  3.52875 -3.451804 0.998701
C  4.46386 -2.439386 1.715938
C  2.324863 -2.649178 0.491088
C  3.770069 -1.078035 1.628884
C  -1.389876 1.709394 -0.371509
C  -3.774608 1.615742 0.221904
C  -4.277491 0.202696 0.024861
C  -4.079782 -0.462639 -1.213418
C  -4.951292 -0.4731 1.07336
C  -4.543466 -1.784007 -1.393671
C  -5.41821 -1.7942 0.892903
C  -5.214125 -2.452364 -0.342189
H  2.784123 2.891134 -1.186413
H  0.696465 1.67184 -1.731614
H  3.081463 4.053909 1.016539
H  3.045325 2.289089 1.275211
H  1.606368 3.29095 1.655174
H  1.693738 5.146142 -0.855314
H  0.740982 4.134958 -1.985625
H  0.196754 4.346848 -0.296854
H  -0.030303 1.45579 1.166556
H  4.008995 -3.9429 0.135915
H  3.16457 -4.249512 1.668349
H  4.635327 -2.686319 2.777371
H  5.453308 -2.356826 1.235258
H  -4.291504 2.125099 1.050336
H  -3.847512 2.209603 -0.70541
H  -3.551719 0.057586 -2.020701
H  -5.107376 0.036119 2.032605
H  -4.382841 -2.292168 -2.350939
H  -5.938955 -2.307768 1.708876
H  -5.574405 -3.477586 -0.484195
