program: Gaussian 09
title: 000100043
version: EM64L-G09RevD.01
frameworkgroup: C1[X(C14H19NO2)]
method: RPBEPBE
basis: SDD
operation: Freq
keyword: #p
keyword: freq=noraman
keyword: PBEPBE/SDD
title: #p freq=noraman PBEPBE/SDD
converged: YES YES NO NO
title: Mulliken charges:
elementType: O O N C C C C C C C C C C C C C C H H H H H H H H H H H H H H H H H H H
charge: -0.303427 -0.302313 -0.129887 -0.004133 -0.488448 -0.381588 -0.432927 -0.602997 -0.499370 0.338730 0.311475 -0.563072 -0.542232 0.204874 0.194117 -0.530151 -0.530227 0.218333 0.205991 0.224558 0.224668 0.174891 0.231709 0.212475 0.225084 0.208669 0.188559 0.236227 0.255549 0.253751 0.221236 0.226768 0.252771 0.219988 0.227033 0.253317
chargesum: 0.00000
title: Mulliken charges with hydrogens summed into heavy atoms:
elementType: O O N C C C C C C C C C C C C C C
charge: -0.303427 -0.302313 -0.129887 0.214200 -0.057899 0.017971 0.000826 -0.158813 -0.074585 0.338730 0.311475 -0.307523 -0.288481 0.204874 0.194117 0.170624 0.170110
polarizability: 2.29304472e+02 -2.24624545e-02 1.57523235e+02 -3.07266018e-01 2.80092792e+00 1.04802564e+02
1716.lowfreq: -4.6160 -0.0005 -0.0002 0.0004 7.3691 13.8299 41.4353 57.4848 73.1512
frequency: 41.3391 57.4279 73.1315 86.5517 103.3971 147.2011 153.2511 157.6897 162.1360 202.0171 208.1118 249.9579 257.7850 277.2242 282.4388 309.4364 382.7520 412.3343 432.1135 478.3054 491.5102 544.8684 560.0176 630.8898 649.9360 655.9720 713.9258 723.3401 739.1503 739.4122 789.4458 813.2577 872.1473 880.8939 894.2965 919.7683 921.7634 955.9947 961.4495 986.9797 1016.0129 1022.9930 1069.8623 1088.3251 1104.1480 1113.6717 1115.3657 1135.6724 1145.4506 1149.3875 1157.0116 1161.8565 1173.3817 1183.5553 1204.5336 1218.6033 1226.0794 1229.1085 1253.2158 1260.9495 1278.2428 1290.1027 1298.9221 1310.0663 1328.7169 1354.0147 1360.0979 1375.4176 1397.9722 1423.6886 1441.8103 1444.3405 1457.0892 1458.2649 1463.1535 1467.2745 1478.1999 1480.4273 1487.7270 1489.2148 1492.8477 1570.5915 1620.0489 2787.8907 2811.6067 2837.0219 2968.6984 2970.4207 2971.3045 2999.9054 3005.8814 3019.9441 3029.4726 3032.5322 3062.0633 3064.7063 3066.3754 3087.8653 3117.7517 3117.9003 3134.2304 3138.4376
redmass: 2.8050 2.3446 2.8509 3.0342 2.6928 3.1215 2.0591 1.1813 1.2414 2.8198 2.6750 3.3078 2.5985 5.6842 4.5777 4.8763 4.3709 3.6035 4.2216 2.4891 3.6181 5.5735 4.5413 3.5841 4.2244 3.9369 4.7907 3.2258 3.4382 3.4209 2.5881 1.8144 1.5228 1.4820 1.5333 5.5666 2.6644 6.2227 1.5909 2.5258 1.8971 3.4466 4.1938 2.1276 2.3453 1.2414 1.2437 2.4941 1.6095 1.4762 1.3762 1.4184 1.9180 2.1849 1.3681 1.2745 1.2932 1.8073 1.4057 1.3918 2.4023 1.3807 1.4779 1.6643 1.4081 1.8479 2.7309 2.6103 2.3721 1.1763 1.1082 1.3843 1.0563 1.0652 1.1041 1.0955 1.0557 1.0906 1.0693 2.3550 1.2187 7.9154 7.2888 1.0718 1.0793 1.0719 1.0309 1.0341 1.0575 1.0850 1.0593 1.0691 1.0996 1.0817 1.1036 1.1035 1.1037 1.1051 1.1027 1.1026 1.0911 1.0918
irintensity: 0.5246 0.8495 0.5908 4.1375 6.6826 4.3699 0.6665 0.0703 0.1502 3.6099 4.9685 5.5902 9.3193 7.1136 0.0474 1.5315 4.8606 1.1066 7.2078 2.8062 3.0603 4.9090 3.2198 2.7578 0.6387 8.7980 7.7342 2.9564 4.5088 5.2816 2.0698 6.4799 5.1402 6.4745 6.5053 50.5821 1.3539 93.3308 12.4096 9.0173 1.3747 13.3310 37.1454 4.2340 11.0364 16.4334 1.4352 28.1427 21.4833 3.3143 23.4254 13.9382 26.4008 13.6615 10.5015 1.1856 11.4893 10.6875 25.4591 14.4515 60.7793 16.7735 8.8513 51.8211 8.0255 6.2447 6.6613 12.8289 13.1436 0.1175 7.3438 10.0034 12.9486 10.3776 21.0265 6.0895 4.9107 9.7970 7.1862 150.4735 16.6517 0.0165 2.6992 60.7608 61.0778 176.2922 97.7107 63.0765 24.9986 26.5745 28.4550 49.0968 31.7412 62.3394 4.2683 33.4174 22.6874 66.8865 22.8064 31.6223 11.0730 1.7844
temp: 298.150 k
press: 1.00000 atm
elementType: 8 8 7 6 6 6 6 6 6 6 6 6 6 6 6 6 6 1 1 1 1 1 1 1 1 1 1 1 1 1 1 1 1 1 1 1
symmnumber: 1
zpe: 795164.0 jmol-1
zpe.correction: 0.302862 hartree
zpe.thermalcorrener: 0.319258 hartree
zpe.thermalcorrenthalpy: 0.320202 hartree
zpe.thermalcorrgfe: 0.258895 hartree
zpe.sumelectzpe: -748.754929 hartree
zpe.sumelectthermal: -748.738533 hartree
zpe.sumelectthermalent: -748.737589 hartree
zpe.sumelectthermalfe: -748.798896 hartree
dipole: 0.6418 -0.1823 0.7610
dipole: 1.0120
quadrupole: -87.7729 -97.9141 -102.7627
quadrupole: -0.3749 2.1595 -3.9350
quadrupole: 8.3770 -1.7642 -6.6128 -0.3749 2.1595 -3.9350
hfenergy: -749.0577911 hartree
pointgroup: C01 [X(C14H19N1O2)]
dipole: -0.2516056 -0.0918906 -0.2946002 debye
polarizability: 229.3051925|0.0100764|156.8994836|0.0785074|-6.351393|105.4255953 unknown
InChI: InChI=1S/C14H19NO2/c1-16-13-7-10-6-12-4-3-5-15(12)9-11(10)8-14(13)17-2/h7-8,12H,3-6,9H2,1-2H3
charge 0 multiplicity 1
36 atoms
O  3.420583 1.419093 -0.317963
O  3.390275 -1.439756 0.339959
N  -2.728709 -0.533618 0.438212
C  -2.73844 0.546062 -0.58559
C  -4.154964 1.154928 -0.43595
C  -4.053788 -1.186251 0.357423
C  -5.03691 -0.000919 0.1500
C  -1.558913 1.493007 -0.318787
C  -1.572431 -1.434218 0.319563
C  -0.252573 0.719905 -0.161475
C  -0.263566 -0.662889 0.17124
C  0.991885 1.379949 -0.307694
C  0.963804 -1.351477 0.317112
C  2.212526 0.699165 -0.138173
C  2.19838 -0.695102 0.15416
C  4.26262 1.510176 0.897307
C  4.240744 -1.542816 -0.868284
H  -2.627734 0.108095 -1.61416
H  -4.537388 1.527302 -1.402336
H  -4.121982 2.008196 0.264938
H  -4.263387 -1.767681 1.273611
H  -4.108279 -1.891113 -0.513737
H  -1.771002 2.050462 0.615798
H  -1.46646 2.238607 -1.132099
H  -5.482415 0.307038 1.111042
H  -5.862458 -0.281383 -0.527125
H  -1.682215 -2.121078 -0.565497
H  -1.524803 -2.082817 1.215658
H  1.031467 2.44836 -0.549217
H  0.982652 -2.421155 0.556471
H  3.733132 2.079721 1.684892
H  5.168498 2.053475 0.587094
H  4.522803 0.504636 1.274751
H  3.7082 -2.101325 -1.661825
H  5.134251 -2.102721 -0.551784
H  4.521698 -0.541156 -1.240937
