program: Gaussian 09
title: 000100036
version: EM64L-G09RevD.01
frameworkgroup: C1[X(C19H13NO7)]
method: RPBEPBE
basis: SDD
operation: Freq
keyword: #p
keyword: freq=noraman
keyword: PBEPBE/SDD
title: #p freq=noraman PBEPBE/SDD
converged: YES YES NO NO
title: Mulliken charges:
elementType: O O O O O O O N C C C C C C C C C C C C C C C C C C C H H H H H H H H H H H H H
charge: -0.212149 -0.383784 -0.286637 -0.186454 -0.207396 -0.369610 -0.250085 -0.604258 0.167373 -0.200475 0.434594 0.021501 -0.043062 0.325676 -0.694500 -0.655614 -0.553921 0.030977 -0.285266 0.194350 0.156095 0.332520 0.259367 0.186396 -0.417070 -0.410264 -0.200023 0.324779 0.264465 0.280462 0.297946 0.212118 0.278926 0.300588 0.394436 0.229736 0.245544 0.316217 0.340530 0.365973
chargesum: 0.00000
title: Mulliken charges with hydrogens summed into heavy atoms:
elementType: O O O O O O O N C C C C C C C C C C C C C C C C C C C
charge: -0.212149 0.010652 -0.286637 -0.186454 -0.207396 -0.003637 -0.250085 0.052488 0.167373 0.124304 0.434594 0.021501 -0.043062 0.325676 -0.149574 -0.357667 -0.062877 0.030977 -0.285266 0.194350 0.156095 0.332520 0.259367 0.186396 -0.116482 -0.180528 0.045521
polarizability: 4.31181568e+02 -1.25562902e+01 2.63370637e+02 5.39950842e+00 1.88040863e+01 1.14759199e+02
1716.lowfreq: -1.8842 -0.0007 -0.0006 0.0002 6.7016 9.2199 26.6439 31.0131 35.9211
frequency: 26.5813 30.9809 35.8781 46.9703 55.8301 68.5452 95.1445 108.0282 131.0831 142.9027 150.3485 166.3304 188.1786 223.3181 241.7531 247.6333 293.3788 326.3879 330.1887 366.5168 368.3071 382.5474 425.5795 427.1525 429.7679 433.5493 448.8424 456.1267 468.3317 483.3639 496.8230 519.3262 527.7294 532.5388 549.4531 565.8800 579.1463 591.5731 595.0810 603.1750 655.4984 672.4355 682.0353 702.1838 732.9330 747.0482 758.2894 767.0126 788.8356 794.6834 844.6710 854.3106 883.6670 895.7043 903.3968 912.8469 927.2585 956.0454 966.6193 991.9945 997.6009 1007.2831 1035.3173 1053.1704 1074.5276 1075.9087 1103.9559 1116.2983 1162.4464 1175.9791 1182.4201 1184.6410 1194.0586 1218.7082 1249.0899 1261.8829 1268.4035 1289.6383 1295.3902 1311.2415 1327.4791 1344.3076 1358.9758 1365.9371 1398.7729 1413.7211 1422.1192 1431.7570 1437.5074 1441.9794 1460.3180 1471.5734 1540.7277 1553.9982 1579.5517 1593.7163 1599.1434 1600.3716 1626.6120 1652.5416 1666.4329 2614.1161 2969.9408 3001.3536 3062.8962 3075.3172 3077.3079 3119.1991 3153.4483 3156.2347 3175.4272 3519.6870 3534.3453 3674.6993
redmass: 6.5485 6.9409 5.6395 7.7657 6.3020 7.2203 4.1937 6.3812 7.8342 6.2669 6.4048 8.0354 4.4790 7.0125 4.8675 7.0426 5.4910 6.6684 8.6542 9.1723 5.5746 2.7074 3.6031 6.3767 6.2339 1.3167 8.1735 3.2363 4.3175 3.4447 1.8783 3.0930 3.2853 4.5541 4.2104 5.3575 4.7855 4.6154 6.2366 2.2179 4.1460 3.1904 3.8384 5.1399 5.2686 4.5484 6.1378 5.3367 5.8227 1.8300 4.7417 3.1616 3.6006 2.8918 2.5493 2.5383 1.9646 2.0297 3.7507 1.0643 1.3811 4.7146 3.1486 4.7995 2.4362 2.4002 3.0432 3.3567 1.3975 1.2294 1.5285 1.3139 1.6185 2.0248 1.9861 1.9962 1.5242 2.0606 2.6586 1.5576 2.9042 2.2755 4.4961 2.6553 7.4833 3.3687 4.0871 1.1728 1.2674 2.8956 4.6597 3.2796 6.5423 4.2393 5.6808 6.1479 3.8176 1.7254 6.2507 3.7324 11.3412 1.0721 1.0685 1.0598 1.0937 1.0913 1.0936 1.0897 1.0920 1.0911 1.0977 1.0452 1.0658 1.1039
irintensity: 4.2562 3.2948 7.6092 6.9394 11.4558 2.1964 5.1125 1.1723 1.2971 3.2278 0.3140 0.9564 0.5267 2.0005 0.8985 1.3395 5.9690 5.4395 4.2589 5.7540 4.7946 7.1182 35.9434 14.2197 21.7341 75.3465 3.0450 26.2264 12.3462 13.9714 40.3163 51.9926 50.8406 5.8232 10.7893 18.2656 2.7238 24.6567 4.1025 57.3963 12.4057 33.0941 17.1827 14.9398 11.5916 8.8845 5.9272 20.1713 15.0548 50.4260 4.8878 0.8765 8.8222 31.9859 19.9175 4.4432 4.9273 18.7918 101.3137 124.1721 3.2764 96.2578 30.6348 20.2861 44.8182 7.1048 15.3294 74.5231 115.6943 41.7018 2.6769 24.4925 53.8629 60.2206 11.6691 33.2464 26.1077 276.9871 243.7779 95.6511 204.2583 292.1580 188.3197 163.2328 2.6530 33.3098 39.8939 16.2649 58.2893 34.4301 50.9952 44.6057 183.1970 74.4774 12.9461 12.1425 92.3062 53.2828 99.2869 259.6002 399.8729 306.2336 5.5452 14.4051 10.0098 2.4650 6.5371 11.7011 0.8844 10.6143 11.2680 40.7670 49.7207 24.0284
temp: 298.150 k
press: 1.00000 atm
elementType: 8 8 8 8 8 8 8 7 6 6 6 6 6 6 6 6 6 6 6 6 6 6 6 6 6 6 6 1 1 1 1 1 1 1 1 1 1 1 1 1
symmnumber: 1
zpe: 749324.2 jmol-1
zpe.correction: 0.285403 hartree
zpe.thermalcorrener: 0.307766 hartree
zpe.thermalcorrenthalpy: 0.308710 hartree
zpe.thermalcorrgfe: 0.232538 hartree
zpe.sumelectzpe: -1311.307409 hartree
zpe.sumelectthermal: -1311.285046 hartree
zpe.sumelectthermalent: -1311.284101 hartree
zpe.sumelectthermalfe: -1311.360274 hartree
dipole: 7.0293 0.2786 5.0720
dipole: 8.6726
quadrupole: -115.1188 -173.9205 -154.3373
quadrupole: -14.3232 -28.4105 0.9256
quadrupole: 32.6734 -26.1283 -6.5451 -14.3232 -28.4105 0.9256
hfenergy: -1311.5928118 hartree
pointgroup: C01 [X(C19H13N1O7)]
dipole: 2.8185388 -0.089198 -1.9209647 debye
polarizability: 431.6654269|8.2653091|261.083802|4.4124011|25.1994659|116.5621755 unknown
InChI: InChI=1S/C19H13NO7/c20-12(22)6-11-14-7(5-13(23)27-11)4-9-16(18(14)25)19(26)15-8(17(9)24)2-1-3-10(15)21/h1-4,11,21,25H,5-6,20H2
charge 0 multiplicity 1
40 atoms
O  -3.961935 -0.387463 0.815533
O  -0.647391 2.171488 0.453952
O  1.84024 2.412865 0.456922
O  2.47259 -2.97125 -0.602128
O  -4.833732 -2.496879 0.788714
O  4.481883 2.69991 0.504386
O  -4.924635 2.893122 0.117996
N  -5.979137 1.573527 -1.4750
C  -1.610467 0.010552 0.081111
C  -2.9862 0.609299 0.264982
C  -1.458519 -1.361038 -0.207918
C  0.85561 0.274296 0.067614
C  -0.457606 0.83746 0.205808
C  0.979644 -1.121065 -0.204923
C  -2.70783 -2.199065 -0.385277
C  -0.166645 -1.926376 -0.340311
C  -3.565879 1.214695 -1.035513
C  2.029845 1.151911 0.217338
C  2.329809 -1.732564 -0.348634
C  -3.913409 -1.734525 0.439865
C  3.382414 0.565387 0.091763
C  3.524352 -0.836908 -0.183558
C  -4.876328 1.965006 -0.738339
C  4.57826 1.340351 0.236067
C  4.797458 -1.432761 -0.309829
C  5.852446 0.726018 0.107115
C  5.960996 -0.649719 -0.163821
H  -2.968508 1.408036 1.024911
H  -3.022399 -2.18729 -1.450262
H  -2.53166 -3.258181 -0.135402
H  -0.031537 -2.99248 -0.548799
H  -3.683745 0.438669 -1.814751
H  -2.838203 1.962914 -1.400761
H  4.84639 -2.504608 -0.520502
H  0.308009 2.595538 0.52266
H  6.757873 1.336323 0.2215
H  6.950711 -1.10707 -0.259917
H  -5.95771 0.776212 -2.10742
H  -6.870742 2.03424 -1.290865
H  5.384283 3.105127 0.584095
