program: Gaussian 09
title: 000102050
version: EM64L-G09RevD.01
frameworkgroup: C1[X(C22H26Cl4N2)]
method: RPBEPBE
basis: SDD
operation: Freq
keyword: #p
keyword: freq=noraman
keyword: PBEPBE/SDD
title: #p freq=noraman PBEPBE/SDD
converged: YES YES NO NO
title: Mulliken charges:
elementType: Cl Cl Cl Cl N N C C C C C C C C C C C C C C C C C C C C C C H H H H H H H H H H H H H H H H H H H H H H H H H H
charge: -0.061638 -0.061634 -0.051552 -0.051558 -0.279351 -0.279362 0.006113 0.006128 -0.461799 -0.440323 -0.461800 -0.440320 -0.432149 -0.432166 -0.471951 -0.471949 0.645117 0.645118 -0.276457 -0.276439 -0.310525 -0.310542 -0.245567 -0.245568 -0.242339 -0.242336 -0.212043 -0.212042 0.182184 0.182186 0.192076 0.194737 0.236406 0.177788 0.194736 0.192075 0.177786 0.236416 0.187241 0.206199 0.187254 0.206194 0.251843 0.251849 0.231087 0.212427 0.231089 0.212423 0.260764 0.260764 0.260625 0.260625 0.241080 0.241082
chargesum: 0.00000
title: Mulliken charges with hydrogens summed into heavy atoms:
elementType: Cl Cl Cl Cl N N C C C C C C C C C C C C C C C C C C C C C C
charge: -0.061638 -0.061634 -0.051552 -0.051558 -0.027508 -0.027513 0.188297 0.188314 -0.074986 -0.026129 -0.074989 -0.026118 -0.038709 -0.038718 -0.028437 -0.028437 0.645117 0.645118 -0.276457 -0.276439 -0.310525 -0.310542 0.015197 0.015195 0.018286 0.018289 0.029038 0.029040
polarizability: 2.90166340e+02 3.25920919e-03 2.98648208e+02 5.62786619e+01 -1.55153983e-03 2.61948237e+02
1716.lowfreq: -11.9084 -0.0017 -0.0014 0.0007 4.1839 8.1588 9.3157 11.6399 11.6641
frequency: 9.2859 10.4843 11.5046 19.1510 24.7965 38.4893 46.7418 51.1689 68.4361 72.0266 107.4451 109.0688 118.7030 136.2300 166.9956 177.6578 193.0437 193.0612 207.4812 215.1621 226.4276 254.0949 264.1946 269.1476 296.1827 301.8306 302.5169 334.6179 368.6383 380.6787 380.7550 390.2218 393.3242 434.5158 448.2725 459.3696 470.1207 471.1721 478.9995 519.6354 519.6647 532.6383 540.7059 586.0261 616.5220 627.1545 684.3342 686.6043 717.2559 717.3621 730.1103 730.1654 770.1135 774.5451 774.8291 787.6553 822.1196 825.5935 841.9159 881.2311 894.0380 894.0566 910.8802 941.5827 946.5407 949.6177 964.4297 967.3269 968.1154 994.0269 1026.0794 1027.1943 1036.8015 1045.0834 1046.9400 1059.8405 1067.7717 1068.0808 1073.9158 1102.2305 1107.4390 1123.3056 1129.9636 1132.6111 1147.2758 1156.8727 1159.2725 1169.0724 1187.4421 1206.5695 1211.5362 1212.1922 1213.1462 1221.8817 1246.9119 1248.8862 1258.0934 1268.1432 1279.1745 1291.7658 1307.9309 1308.9065 1325.2782 1326.8253 1341.4039 1343.0326 1348.5722 1362.0110 1368.4005 1368.4329 1385.4694 1385.5464 1417.8051 1417.8228 1431.8675 1431.8760 1450.2566 1450.5007 1459.8323 1461.4773 1472.4012 1474.7411 1476.6603 1478.2274 1486.8724 1487.1310 1562.9158 1562.9411 1594.0634 1594.0664 2842.1047 2842.6770 2892.9597 2893.1943 2920.0400 2922.6002 2952.1852 2952.5431 2958.1529 2963.9468 2989.5503 2989.7708 3010.8556 3021.6759 3046.5591 3046.5636 3050.0996 3050.2655 3151.2947 3151.2976 3173.6548 3173.6603 3184.3336 3184.3400 3421.4101 3421.4301
redmass: 16.0533 14.1993 7.9546 6.1404 9.0526 3.8085 3.7224 6.3905 6.8862 6.4552 5.4499 5.3737 2.8957 2.2758 5.5052 5.9051 4.5871 4.5871 7.1944 5.4407 2.1753 2.1955 6.7762 4.2670 3.6374 3.2805 3.1627 8.0396 10.0388 5.8991 5.9035 2.0609 4.5826 2.6509 2.3842 3.3801 4.0050 4.1668 3.8393 5.4422 5.4440 4.1005 3.6956 2.5953 4.7332 3.2464 1.5019 1.4966 6.0870 6.1134 3.0891 3.1366 2.6542 1.4288 1.4663 1.4940 3.9859 4.8130 2.3060 1.6852 1.3578 1.3578 1.3276 2.0662 1.5187 1.8642 1.7802 1.3313 1.4426 1.7800 3.2801 2.4684 2.7926 4.2313 2.9811 1.0948 2.6175 2.5913 1.9441 3.0771 2.7973 2.2723 3.3783 2.4920 1.6029 1.7276 1.2792 1.2293 1.6634 1.4399 2.4526 2.1548 1.4856 1.3528 1.1945 1.3518 1.2893 1.2232 1.2739 1.1799 1.2623 1.3016 1.3127 1.2848 1.4914 1.4541 1.6634 1.5543 5.9986 5.9010 1.4603 1.4549 2.1798 2.1804 3.2038 3.2023 1.1702 1.1726 1.0881 1.0886 1.0822 1.0970 1.0991 1.0976 1.0775 1.0788 6.6781 6.6786 8.2679 8.2684 1.0708 1.0706 1.0707 1.0707 1.0807 1.0809 1.0585 1.0667 1.0671 1.0650 1.0878 1.0875 1.0974 1.1023 1.0874 1.0875 1.0921 1.0978 1.0875 1.0875 1.0930 1.0930 1.0996 1.0996 1.0741 1.0741
irintensity: 0.0039 0.0212 0.0769 0.6981 0.0051 0.6759 0.0212 0.0135 5.6336 0.0921 0.1713 1.3621 0.1409 2.9746 0.2260 0.0146 0.0113 0.0017 3.7716 0.4214 0.6497 0.0800 2.0288 0.5045 0.2124 4.3917 0.9264 1.5045 1.5532 4.2081 9.0573 0.8484 8.6249 0.9924 2.0533 2.1430 0.7472 6.9349 0.0001 0.0671 0.0115 0.3439 0.1895 0.0471 4.2530 9.9114 76.1736 98.2727 31.9746 84.1069 21.9722 26.4561 0.7089 117.1618 10.8101 0.0729 0.1495 0.1684 0.3784 5.3125 0.0114 0.0015 6.8372 20.2340 13.6078 0.0215 22.9346 0.1084 9.7860 3.7154 0.6569 5.2550 2.5688 11.5476 11.7269 2.9945 19.8002 11.9899 0.3873 62.5051 0.9011 67.1391 54.4504 0.1734 16.7382 1.3970 0.0340 9.2945 5.4927 1.2196 2.3287 3.3538 18.7260 3.3295 3.1071 8.5242 2.4756 9.3721 1.0558 0.4161 5.5940 1.1922 11.2871 2.5668 18.6810 5.0993 0.0016 0.9801 0.2724 6.4150 0.2409 0.0555 33.1939 79.7309 7.4443 12.0095 62.4026 18.3816 1.4532 10.9936 16.5126 0.0000 5.7592 4.1830 12.7849 2.9378 24.0096 71.8170 13.2582 22.7450 5.5618 201.3358 135.9503 49.7253 23.0167 0.3680 31.9819 35.4827 10.7641 59.7221 65.5064 0.4573 63.9040 87.8289 0.7146 15.4789 24.6528 47.4779 3.7781 5.3950 1.2961 1.2204 5.8041 8.7606 0.4341 0.3240
temp: 298.150 k
press: 1.00000 atm
elementType: 17 17 17 17 7 7 6 6 6 6 6 6 6 6 6 6 6 6 6 6 6 6 6 6 6 6 6 6 1 1 1 1 1 1 1 1 1 1 1 1 1 1 1 1 1 1 1 1 1 1 1 1 1 1
symmnumber: 1
zpe: 1134267.6 jmol-1
zpe.correction: 0.432020 hartree
zpe.thermalcorrener: 0.460357 hartree
zpe.thermalcorrenthalpy: 0.461302 hartree
zpe.thermalcorrgfe: 0.365853 hartree
zpe.sumelectzpe: -2801.576726 hartree
zpe.sumelectthermal: -2801.548389 hartree
zpe.sumelectthermalent: -2801.547445 hartree
zpe.sumelectthermalfe: -2801.642894 hartree
dipole: -0.0003 1.0051 0.0000
dipole: 1.0051
quadrupole: -173.6223 -178.0639 -195.3603
quadrupole: 0.0003 10.1514 -0.0004
quadrupole: 8.7266 4.2849 -13.0115 0.0003 10.1514 -0.0004
hfenergy: -2802.0087461 hartree
pointgroup: C01 [X(C22H26Cl4N2)]
dipole: 0.0001318 0.3954375 -0.0001322 debye
polarizability: 290.318735|0.0175332|298.6482038|56.2402343|-0.0124145|261.7958455 unknown
InChI: InChI=1S/C22H26Cl4N2/c23-19-3-1-4-20(24)17(19)13-27-11-15-7-9-16(10-8-15)12-28-14-18-21(25)5-2-6-22(18)26/h1-6,15-16,27-28H,7-14H2
charge 0 multiplicity 1
54 atoms
Cl -6.714212 -1.084996 -1.866909
Cl 6.714119 -1.08375 1.867319
Cl -4.797617 1.712474 2.614138
Cl 4.797543 1.710666 -2.615642
N  -3.749712 -0.941598 0.137788
N  3.749801 -0.941948 -0.137312
C  -1.505352 -2.029979 -0.032726
C  1.505427 -2.030126 0.033993
C  -0.70171 -3.305153 0.327077
C  -0.695686 -0.762558 0.335701
C  0.701652 -3.305474 -0.3249
C  0.695903 -0.762887 -0.335354
C  -2.897894 -2.047236 0.635032
C  2.897979 -2.047952 -0.633737
C  -5.076684 -0.860156 0.792894
C  5.076669 -0.860762 -0.792651
C  -5.817934 0.390586 0.351811
C  5.817853 0.390319 -0.352407
C  -6.596008 0.427534 -0.833073
C  6.595894 0.428089 0.832474
C  -5.769115 1.612713 1.070662
C  5.769015 1.61196 -1.072077
C  -7.284521 1.567562 -1.287692
C  7.284357 1.568442 1.286348
C  -6.440429 2.781722 0.663002
C  6.440284 2.781264 -0.665184
C  -7.202503 2.753082 -0.525129
C  7.202323 2.753448 0.522988
H  -1.654257 -2.028852 -1.137733
H  1.654322 -2.028225 1.1390
H  -0.591642 -3.360365 1.431365
H  -1.262482 -4.209817 0.016227
H  -1.273012 0.137597 0.057023
H  -0.573206 -0.729769 1.440013
H  1.262316 -4.209977 -0.013391
H  0.591585 -3.361468 -1.429148
H  0.573424 -0.730883 -1.439688
H  1.273339 0.1374 -0.057332
H  -3.368017 -3.053019 0.480032
H  -2.778888 -1.915989 1.730282
H  3.368072 -3.05363 -0.477979
H  2.77899 -1.917521 -1.729086
H  -3.846379 -0.977915 -0.887856
H  3.846605 -0.977599 0.888341
H  -4.908166 -0.814618 1.883028
H  -5.720046 -1.749776 0.590926
H  4.908003 -0.815891 -1.88279
H  5.720162 -1.750186 -0.590237
H  -7.866784 1.528956 -2.211945
H  7.866597 1.530476 2.210643
H  -6.36654 3.693206 1.261891
H  6.366381 3.692343 -1.264688
H  -7.730062 3.652814 -0.856808
H  7.729842 3.65342 0.854077
