program: Gaussian 09
title: 000100010
version: EM64L-G09RevD.01
frameworkgroup: C1[X(C8H12N4O5)]
method: RPBEPBE
basis: SDD
operation: Freq
keyword: #p
keyword: freq=noraman
keyword: PBEPBE/SDD
title: #p freq=noraman PBEPBE/SDD
converged: YES YES NO NO
title: Mulliken charges:
elementType: O O O O O N N N N C C C C C C C C H H H H H H H H H H H H
charge: -0.471408 -0.481603 -0.237381 -0.212972 -0.275506 -0.327866 -0.113328 -0.026110 0.095135 -0.032477 -0.406776 -0.560244 0.266780 -0.362190 0.244227 -0.118799 -0.277000 0.214016 0.221349 0.274027 0.250577 0.285694 0.331390 0.200689 0.222841 0.282454 0.364361 0.270806 0.379314
chargesum: 0.00000
title: Mulliken charges with hydrogens summed into heavy atoms:
elementType: O O O O O N N N N C C C C C C C C
charge: -0.107048 -0.102289 -0.237381 -0.212972 -0.275506 0.003523 -0.113328 -0.026110 0.095135 0.181539 0.088599 -0.023973 0.266780 0.061340 0.244227 0.163655 -0.006194
polarizability: 1.68163140e+02 -1.04350171e+01 1.45456166e+02 2.47009650e+01 4.51744089e+00 1.05172391e+02
1716.lowfreq: -12.9155 -9.9609 -0.0011 -0.0010 -0.0009 9.0618 30.9159 52.1559 73.8700
frequency: 30.9110 52.1264 73.8695 89.5426 93.1246 115.7312 127.2748 148.8803 186.0928 207.5229 229.9010 258.1153 277.7585 297.2473 321.7532 337.8257 403.9679 428.0856 443.1530 509.6800 513.4659 570.0263 605.2692 614.5753 626.2655 636.6661 659.8563 694.2749 715.2184 753.8708 773.9903 796.1999 815.5286 851.8844 867.6899 881.7653 918.0086 930.8147 963.7272 983.8063 1039.9694 1053.4229 1077.1335 1101.4248 1104.2235 1147.5167 1159.8936 1187.5693 1214.3020 1232.7729 1258.2020 1264.5148 1301.2795 1318.1808 1325.0912 1327.6032 1333.6371 1350.5769 1354.0482 1356.3985 1368.8975 1382.5457 1418.2948 1444.1124 1457.6413 1459.6162 1472.7871 1524.5266 1650.3059 2959.7977 2988.8921 3007.6077 3062.6719 3071.0471 3090.7721 3142.7212 3236.2994 3260.2237 3439.1462 3466.9969 3483.0162
redmass: 7.4666 5.7989 8.1362 7.6899 7.9988 7.2385 2.9036 6.2701 6.6486 6.6246 5.4201 4.1350 5.3390 4.7337 6.5072 1.9769 1.4128 3.4160 3.8600 3.3391 4.4399 4.9557 4.1748 1.8779 3.7599 1.5416 4.8481 7.4170 1.5063 10.8657 1.5960 3.2389 3.1101 2.6469 1.5100 5.7290 2.5404 2.5276 2.7978 2.8160 2.2781 2.1826 2.1828 2.3878 2.9269 2.7780 1.9149 1.2131 1.1795 3.5097 1.3288 1.9503 4.2766 1.5050 1.3084 1.5865 1.9823 1.6967 2.2879 2.3482 1.7728 1.4449 3.3572 1.9260 1.0875 1.1072 1.5730 1.6161 6.3936 1.0846 1.0589 1.0660 1.1055 1.0586 1.0982 1.1069 1.0929 1.1080 1.0789 1.0644 1.0678
irintensity: 2.3645 2.9659 1.9791 6.3685 5.3206 9.0575 4.7332 1.3783 0.3240 5.4696 20.8482 29.8115 9.9853 14.0564 2.5153 62.4453 129.4959 5.9662 24.7927 34.8922 0.9882 5.8418 3.9871 85.6740 11.6351 86.3238 17.2426 19.1890 153.2269 13.7780 49.7017 12.9265 19.7800 24.7600 5.4108 12.2711 0.7460 9.1226 47.3063 11.6121 61.9276 17.9715 1.9181 33.8583 24.1900 41.6658 61.6255 18.5538 40.7265 20.7660 0.2261 46.7455 114.9551 30.9480 19.1138 57.6157 15.7643 53.5771 68.2074 77.8874 104.0095 24.5748 7.2679 10.7443 23.8828 20.6191 31.5364 136.1657 175.0735 49.7861 30.6664 60.1604 53.2332 12.2600 2.6162 0.6228 3.6834 0.0656 31.9770 34.8760 88.4275
temp: 298.150 k
press: 1.00000 atm
elementType: 8 8 8 8 8 7 7 7 7 6 6 6 6 6 6 6 6 1 1 1 1 1 1 1 1 1 1 1 1
symmnumber: 1
zpe: 572420.0 jmol-1
zpe.correction: 0.218023 hartree
zpe.thermalcorrener: 0.234143 hartree
zpe.thermalcorrenthalpy: 0.235087 hartree
zpe.thermalcorrgfe: 0.173927 hartree
zpe.sumelectzpe: -905.768618 hartree
zpe.sumelectthermal: -905.752498 hartree
zpe.sumelectthermalent: -905.751554 hartree
zpe.sumelectthermalfe: -905.812714 hartree
dipole: -2.0470 2.4173 2.3578
dipole: 3.9487
quadrupole: -82.2355 -116.2061 -100.1742
quadrupole: 5.4707 1.6026 5.0926
quadrupole: 17.3031 -16.6675 -0.6356 5.4707 1.6026 5.0926
hfenergy: -905.986641 hartree
pointgroup: C01[X(C8H12N4O5)]
dipole: -0.6374093 0.9161371 1.0806979 debye
polarizability: 156.813738|-20.1032812|151.0891476|26.3777775|5.557573|110.8888114 unknown
InChI: InChI=1S/C8H12N4O5/c13-5-6(14)3-10-7(15)4-11-2-1-9-8(11)12(16)17/h1-2,6,10,13-14H,3-5H2
charge 0 multiplicity 1
29 atoms
O  1.788283 0.088834 -1.20917
O  3.010974 -2.213987 -0.515886
O  0.455769 3.199033 0.219104
O  0.144749 -2.477722 0.047571
O  0.165298 -1.071887 1.850344
N  1.546277 1.386071 1.236924
N  -1.532675 0.731088 0.444878
N  -1.932274 -0.942798 -1.074075
N  -0.273316 -1.421211 0.662727
C  3.014648 0.251635 -0.425633
C  2.806149 1.485086 0.485737
C  -0.893804 1.583048 1.478142
C  0.44553 2.148738 0.923223
C  3.316443 -1.064986 0.352494
C  -1.228593 -0.578249 0.023843
C  -2.460607 1.205537 -0.468941
C  -2.704985 0.158816 -1.38407
H  3.870005 0.468741 -1.101053
H  3.666881 1.588901 1.17396
H  2.7419 2.395497 -0.132702
H  -1.565142 2.433657 1.669418
H  -0.758138 0.995051 2.395883
H  1.368129 0.520125 1.759859
H  2.728654 -1.129573 1.289081
H  4.391431 -1.115887 0.600901
H  -2.843095 2.22131 -0.414419
H  1.870123 -0.797209 -1.659086
H  -3.385253 0.15316 -2.231691
H  2.161541 -2.637018 -0.217263
