program: Gaussian 09
title: 000102030
version: EM64L-G09RevD.01
frameworkgroup: C1[X(C19H28O3)]
method: RPBEPBE
basis: SDD
operation: Freq
keyword: #pfreq=noraman
keyword: PBEPBE/SDD
title: #p freq=noraman PBEPBE/SDD
converged: NO YES NO NO
title: Mulliken charges:
elementType: O O O C C C C C C C C C C C C C C C C C C C H H H H H H H H H H H H H H H H H H H H H H H H H H H H
charge: -0.451601 -0.182885 -0.446460 -0.090912 -0.158922 -0.166914 0.314657 0.264214 -0.547695 -0.518663 -0.551423 -0.495901 0.488369 -0.515314 -0.006733 -0.135716 -0.798277 -0.481639 -0.832125 -0.655850 -0.475567 -0.042034 0.200705 0.243923 0.233034 0.224507 0.221491 0.217806 0.220528 0.256882 0.219940 0.219289 0.217816 0.208224 0.215452 0.224605 0.241605 0.228702 0.235851 0.214176 0.230066 0.223755 0.221717 0.237433 0.226313 0.221359 0.194780 0.199383 0.357548 0.330501
chargesum: 0.00000
title: Mulliken charges with hydrogens summed into heavy atoms:
elementType: O O O C C C C C C C C C C C C C C C C C C C
charge: -0.094053 -0.182885 -0.115959 0.109793 0.085001 0.066120 0.314657 0.264214 -0.101697 -0.080329 -0.074601 -0.058795 0.488369 -0.091638 -0.006733 0.088889 -0.092119 -0.267463 -0.156586 -0.192104 -0.059427 0.157349
polarizability: 2.53329113e+02 -6.98287413e+00 1.93618555e+02 3.42464503e+00 2.79652661e+00 1.58913540e+02
1716.lowfreq: -7.6151 0.0002 0.0005 0.0006 4.4459 8.4109 33.4566 40.0988 58.9016
frequency: 33.0230 39.5498 58.5418 83.4502 98.6070 132.0460 147.2184 182.2240 200.1768 205.3906 219.0099 233.2142 245.3941 255.6334 259.8135 272.9718 288.0394 290.5504 300.7176 312.7590 324.4262 362.6443 365.2567 388.5963 407.9554 412.3128 427.9464 451.8798 454.3952 475.2276 485.8593 510.4359 537.7490 572.7639 591.5181 597.5689 621.3628 679.1267 707.1645 731.5454 777.0911 794.4092 805.4407 819.6671 831.9296 840.5729 862.2346 883.1134 897.4338 915.2433 926.7057 935.6249 950.0868 971.9663 982.6827 993.9367 1001.0782 1005.4621 1008.1800 1016.2483 1025.9253 1035.2794 1057.9663 1065.2408 1078.2878 1097.5365 1101.0320 1119.4994 1129.1801 1131.8259 1137.8455 1151.7115 1158.6196 1169.2379 1181.5471 1186.7638 1193.7114 1209.6374 1214.0561 1234.8275 1246.8768 1253.1614 1258.5923 1268.1591 1276.0359 1288.9625 1292.1216 1296.6783 1298.8775 1313.1561 1323.5704 1328.3760 1331.0083 1337.4055 1343.1345 1345.2278 1346.6688 1352.8088 1364.7825 1372.3728 1384.2607 1386.9040 1389.6324 1454.9403 1456.1485 1456.9229 1460.8185 1466.4550 1469.7565 1475.5747 1483.2744 1483.6174 1490.3005 1496.3904 1649.1502 1684.5617 2918.6978 2923.3921 2930.3583 2931.6047 2950.9707 2961.3433 2972.3019 2974.5920 2978.1943 2981.1083 2982.2650 2988.9881 2992.7785 2998.9804 3013.5497 3027.7804 3037.0492 3042.3640 3049.5674 3053.7098 3072.1551 3078.8207 3083.0021 3086.1168 3086.4833 3094.3786 3501.1621 3553.7197
redmass: 5.9339 6.3941 3.1556 4.0440 4.5960 3.3797 2.5014 1.5252 1.9833 1.9653 2.6457 3.7766 1.5925 2.9339 2.7758 2.6906 1.9898 2.5606 1.4314 2.8348 2.4159 3.3582 2.3410 2.4062 2.8250 1.8989 2.2814 2.8327 2.0474 3.5380 2.9058 2.8048 3.4871 4.2773 2.8712 3.6426 4.0185 2.9483 3.1544 3.0665 3.8235 2.0818 1.8694 2.0585 1.8967 2.5731 2.0744 1.6645 2.6564 2.1466 1.8897 1.7994 1.8371 2.0478 2.0843 2.3820 2.6038 2.2362 2.1281 2.1074 2.0910 2.0479 2.5110 2.1759 2.7723 1.9047 1.7689 2.0818 1.5561 2.2096 2.0889 1.6133 1.7509 1.6122 1.5306 1.8961 1.6362 1.6854 1.6612 1.4198 1.6983 1.6385 1.5130 1.2534 1.3557 1.3786 1.3739 1.4882 1.3493 1.3262 1.3202 1.4235 1.4166 1.4462 1.4431 1.5805 1.5762 1.4417 1.4620 1.5338 1.3921 1.2061 1.4002 1.0821 1.0870 1.0818 1.0819 1.0756 1.0795 1.0784 1.0700 1.0680 1.0582 1.0627 12.2054 7.8604 1.0818 1.0804 1.0668 1.0833 1.0828 1.0623 1.0819 1.0626 1.0594 1.0565 1.0474 1.0401 1.0562 1.0909 1.0647 1.0979 1.0985 1.0991 1.1019 1.0978 1.0982 1.0993 1.0975 1.1002 1.0904 1.0983 1.0653 1.0660
irintensity: 3.5197 2.4652 0.5699 0.1535 0.3189 0.6917 1.8605 1.0578 2.3805 0.0668 5.4787 8.6649 2.3585 1.6709 10.1009 3.8689 18.6737 4.8765 96.4442 4.6817 28.4742 22.2776 9.2505 32.0317 15.3631 76.9456 21.4768 3.8847 1.5933 4.5603 3.2712 1.4900 0.6292 8.0452 0.8797 4.0672 6.4383 2.1446 1.9437 7.3957 1.4678 3.2344 11.1709 1.4733 8.1082 8.7341 18.2733 5.1154 5.8544 8.1617 15.1224 6.8882 4.7570 9.2207 55.4813 36.0720 18.7801 70.1893 6.7700 30.2032 24.8916 9.7902 0.1987 4.7584 4.5727 10.3879 3.8077 7.7129 2.4162 3.4601 10.9406 30.7881 2.7246 7.5999 10.7639 18.6354 4.0882 9.3508 18.9340 1.0533 2.9614 3.8413 12.9869 2.1509 11.3139 12.3814 0.2071 0.5171 2.8863 0.5425 1.1118 1.7542 1.9963 2.0332 1.0297 13.6687 14.1951 1.8757 11.6934 6.5134 9.2490 26.1069 9.7184 9.3052 7.7290 2.6572 10.2897 7.0485 10.2710 4.6087 3.8654 26.6025 1.0657 12.5594 171.0677 2.3043 1.3386 18.2145 24.9823 47.0787 39.7549 30.8933 18.5526 56.9493 23.6221 12.3939 36.5615 12.5864 36.6633 29.4376 42.9976 14.4263 44.2537 54.8788 43.5608 37.9801 25.9380 29.4554 39.1735 14.1935 45.0676 23.9621 7.7186 2.2958
temp: 298.150 k
press: 1.00000 atm
elementType: 8 8 8 6 6 6 6 6 6 6 6 6 6 6 6 6 6 6 6 6 6 6 1 1 1 1 1 1 1 1 1 1 1 1 1 1 1 1 1 1 1 1 1 1 1 1 1 1 1 1
symmnumber: 1
zpe: 1136781.5 jmol-1
zpe.correction: 0.432977 hartree
zpe.thermalcorrener: 0.454031 hartree
zpe.thermalcorrenthalpy: 0.454975 hartree
zpe.thermalcorrgfe: 0.384953 hartree
zpe.sumelectzpe: -964.765081 hartree
zpe.sumelectthermal: -964.744027 hartree
zpe.sumelectthermalent: -964.743083 hartree
zpe.sumelectthermalfe: -964.813104 hartree
dipole: 1.4817 -1.4155 0.7612
dipole: 2.1859
quadrupole: -152.8132 -137.1744 -130.7311
quadrupole: -9.6856 -17.2330 0.6354
quadrupole: -12.5736 3.0652 9.5084 -9.6856 -17.2330 0.6354
hfenergy: -965.1980577 hartree
pointgroup: C01 [X(C19H28O3)]
dipole: 0.5657482 -0.5742068 0.2997371 debye
polarizability: 252.861153|-8.5655507|193.9691243|4.2677279|2.9266778|159.03093 unknown
InChI: InChI=1S/C19H28O3/c1-18-7-5-12(20)9-11(18)3-4-13-14(18)6-8-19(2)15(13)10-16(21)17(19)22/h3,12-16,20-21H,4-10H2,1-2H3
charge 0 multiplicity 1
50 atoms
O  -4.811459 1.73254 -1.116017
O  -4.7547 -1.152455 -0.948906
O  6.200126 0.285093 -0.282706
C  0.414425 -0.46206 -0.288474
C  -0.40458 0.67887 0.400825
C  -1.86589 0.620081 -0.079707
C  -2.542451 -0.765603 0.173152
C  1.909109 -0.503227 0.215762
C  -0.287285 -1.851857 -0.20686
C  -1.783185 -1.842291 -0.624371
C  -2.894668 1.663979 0.44089
C  0.224865 2.05217 0.069931
C  2.501954 0.921922 0.249252
C  2.750224 -1.357275 -0.797048
C  -3.961087 -0.435123 -0.291644
C  -4.267311 1.052903 0.067142
C  -2.653275 -1.14088 1.68568
C  1.734282 2.042237 0.165524
C  2.018171 -1.127991 1.642515
C  4.015571 1.034937 0.397781
C  4.276027 -1.290575 -0.559888
C  4.768905 0.16658 -0.62383
H  0.459944 -0.184043 -1.367199
H  -0.370041 0.539922 1.501595
H  -1.835493 0.742135 -1.187578
H  -0.210338 -2.249238 0.822209
H  0.249606 -2.571636 -0.853121
H  -1.875675 -1.621917 -1.706542
H  -2.227086 -2.843146 -0.464543
H  -2.78601 2.650271 -0.039054
H  -2.808852 1.805486 1.534023
H  -0.184702 2.829583 0.746311
H  -0.080098 2.361749 -0.955066
H  2.531911 -0.994981 -1.823521
H  2.422396 -2.4130 -0.752716
H  -5.004066 1.095368 0.897712
H  -1.656507 -1.274622 2.137071
H  -3.182993 -0.369937 2.273038
H  -3.207315 -2.090868 1.793067
H  2.232837 3.023078 0.170339
H  3.02845 -0.993854 2.065232
H  1.307802 -0.648698 2.339792
H  1.811431 -2.21371 1.625983
H  4.334671 2.087303 0.294004
H  4.344094 0.701077 1.403218
H  4.543108 -1.709561 0.429343
H  4.796351 -1.905778 -1.322813
H  4.591114 0.562158 -1.649849
H  -5.47248 1.117425 -1.534972
H  6.724676 -0.276843 -0.908365
