program: Gaussian 09
title: 000009173
version: EM64L-G09RevD.01
frameworkgroup: C1[X(C17H11N)]
method: RPBEPBE
basis: SDD
operation: Freq
keyword: #pfreq=noraman
keyword: PBEPBE/SDD
title: #p freq=noraman PBEPBE/SDD
converged: NO YES NO YES
title: Mulliken charges:
elementType: N C C C C C C C C C C C C C C C C C H H H H H H H H H H H
charge: -0.013717 0.267893 0.319822 0.163899 0.234340 0.437413 -0.444337 -0.107411 -0.398530 -0.514998 -0.372601 -0.346175 -0.282693 -0.437595 -0.258378 -0.249740 -0.195242 -0.372928 0.221378 0.226403 0.237006 0.261246 0.222144 0.230055 0.243057 0.229269 0.231093 0.227941 0.241389
chargesum: 0.00000
title: Mulliken charges with hydrogens summed into heavy atoms:
elementType: N C C C C C C C C C C C C C C C C C
charge: -0.013717 0.267893 0.319822 0.163899 0.234340 0.437413 -0.222959 -0.107411 -0.172127 -0.277993 -0.111355 -0.124031 -0.052638 -0.194538 -0.029109 -0.018648 0.032699 -0.131540
polarizability: 3.57134612e+02 7.44444432e+00 1.95073432e+02 -5.41437328e-03 2.89058975e-03 7.08718457e+01
1716.lowfreq: -10.0928 -7.2382 -0.0005 -0.0004 0.0001 10.8917 53.0881 79.5069 132.5514
frequency: 53.0840 79.5067 132.5466 180.3078 183.7391 235.7633 287.6904 290.8036 375.4882 386.7497 432.7271 470.0375 476.4427 481.8439 518.5487 539.8207 561.9249 563.8599 568.4709 588.0459 663.3345 676.6331 695.0459 755.7212 763.4948 769.1129 799.1552 816.0766 849.5533 850.3064 859.4382 870.5270 878.0058 889.5102 935.6734 956.8982 976.9122 981.7744 987.6055 994.4928 997.6303 1035.9791 1047.2649 1070.6334 1137.6654 1148.0669 1173.0065 1181.6903 1228.3675 1233.0971 1242.3224 1251.0684 1269.2583 1302.0849 1344.9017 1354.2102 1380.5960 1406.4339 1413.3492 1416.4079 1434.7472 1448.1653 1483.3229 1514.8457 1528.6248 1566.3012 1580.2363 1601.6705 1617.2877 1629.2794 3122.4917 3123.4718 3125.2198 3133.9744 3144.1519 3146.5475 3154.8806 3157.9249 3166.4388 3168.9568 3174.9161
redmass: 4.8436 4.4429 3.6844 4.7617 5.1483 3.6494 6.4298 4.3087 5.6617 3.3703 3.2222 5.0285 3.7830 6.1274 2.8675 5.8859 7.7011 3.4150 7.8022 2.8230 7.0464 6.0180 3.1279 1.5944 1.5143 6.1945 1.5546 1.5970 5.4719 1.8496 2.7042 4.1577 5.3117 2.0102 1.4279 1.3843 1.4217 1.3562 1.3697 1.3521 5.7162 2.2614 2.3744 3.0907 1.5545 1.2441 1.2037 1.1699 2.0541 1.8459 1.7332 1.9239 1.7341 2.2535 3.6646 3.4184 2.4693 5.8113 2.4309 2.3520 3.3502 2.3273 3.2256 3.9688 3.9801 7.5706 5.9964 6.7858 6.2998 6.5931 1.0867 1.0885 1.0875 1.0886 1.0907 1.0905 1.0914 1.0955 1.0990 1.0976 1.0966
irintensity: 0.5113 0.2548 0.8422 0.0188 0.5407 10.5896 0.0529 0.0000 1.1809 1.2069 6.9089 13.1577 1.5182 1.1763 0.0432 4.1289 0.7353 0.8839 1.1764 7.0751 2.2772 3.8145 1.1205 10.8545 26.3537 0.0700 60.3337 63.9960 1.4491 51.5034 1.0282 1.1506 3.4126 10.5044 0.1173 2.0782 3.2769 0.0544 0.0190 0.4590 0.8482 6.6216 1.5367 6.7568 2.3141 0.7009 0.7551 1.4421 10.6845 2.7419 5.4434 0.8242 9.7729 6.5538 1.7035 4.5882 15.5306 1.8950 4.1000 11.3541 2.9726 6.8440 36.6613 7.0095 0.7458 3.5185 5.9554 2.0347 3.0002 0.3620 1.4571 14.8349 11.0470 8.7454 15.7258 6.6704 19.5619 16.0912 25.1075 41.1453 21.2583
temp: 298.150 k
press: 1.00000 atm
elementType: 7 6 6 6 6 6 6 6 6 6 6 6 6 6 6 6 6 6 1 1 1 1 1 1 1 1 1 1 1
symmnumber: 1
zpe: 592355.8 jmol-1
zpe.correction: 0.225616 hartree
zpe.thermalcorrener: 0.237838 hartree
zpe.thermalcorrenthalpy: 0.238782 hartree
zpe.thermalcorrgfe: 0.187065 hartree
zpe.sumelectzpe: -708.006032 hartree
zpe.sumelectthermal: -707.993810 hartree
zpe.sumelectthermalent: -707.992866 hartree
zpe.sumelectthermalfe: -708.044583 hartree
dipole: -1.5871 2.0974 0.0000
dipole: 2.6302
quadrupole: -91.4798 -91.0380 -111.1549
quadrupole: 10.0438 -0.0007 0.0003
quadrupole: 6.4111 6.8529 -13.2640 10.0438 -0.0007 0.0003
hfenergy: -708.2316479 hartree
pointgroup: C01 [X(C17H11N1)]
dipole: 0.6294502 0.8213307 -0.0000129 debye
polarizability: 357.0373979|-8.4359273|195.1706462|-0.005432|-0.0028574|70.8718457 unknown
InChI: InChI=1S/C17H11N/c1-2-5-13-12(4-1)7-8-15-14(13)9-10-17-16(15)6-3-11-18-17/h1-11H
charge 0 multiplicity 1
29 atoms
N  -3.800399 -1.178115 0.000055
C  0.423306 -0.559151 -0.00001
C  -0.432639 0.592432 -0.000018
C  1.875557 -0.386364 -0.000043
C  -1.880934 0.415863 0.000028
C  2.42745 0.948859 -0.00012
C  0.161605 1.906799 -0.000113
C  -2.437708 -0.919023 0.000037
C  -0.177227 -1.871854 0.0000
C  1.534761 2.078548 -0.000162
C  -1.550226 -2.049785 0.000023
C  2.792171 -1.48623 -0.000002
C  -2.817452 1.497171 0.00006
C  3.845555 1.135657 -0.000142
C  4.177314 -1.281378 -0.000024
C  4.713736 0.040185 -0.000099
C  -4.192185 1.234001 0.000096
C  -4.639154 -0.120807 0.000064
H  -0.481308 2.791938 -0.000175
H  0.463746 -2.757789 -0.000023
H  1.966328 3.086563 -0.000242
H  -2.005678 -3.044356 0.000013
H  2.41697 -2.513605 0.000055
H  -2.471744 2.534928 0.000103
H  4.240828 2.158503 -0.0002
H  4.854535 -2.142624 0.000011
H  5.798646 0.19102 -0.000122
H  -4.922433 2.049499 0.000168
H  -5.71102 -0.352884 0.00008
