program: Gaussian 09
title: 000149922
version: EM64L-G09RevD.01
frameworkgroup: C1[X(C20H22ClN5O4)]
method: RPBEPBE
basis: SDD
operation: Freq
keyword: #p
keyword: freq=noraman
keyword: PBEPBE/SDD
title: #p freq=noraman PBEPBE/SDD
converged: YES YES NO NO
title: Mulliken charges:
elementType: Cl O O O O N N N N N C C C C C C C C C C C C C C C C C C C C H H H H H H H H H H H H H H H H H H H H H H
charge: 0.003189 -0.226694 -0.359681 -0.222118 -0.274671 -0.398099 -0.093100 -0.212828 -0.620497 -0.632404 -0.434100 0.066660 0.067310 -0.350356 0.121940 -0.328964 0.299589 0.130944 0.203080 -0.231224 0.047586 0.434468 0.170516 -0.793022 -0.364283 -0.616275 -0.608089 -0.380285 -0.240817 0.126996 0.208944 0.212756 0.279712 0.210787 0.192658 0.209342 0.362983 0.269022 0.246013 0.242456 0.225721 0.223014 0.188277 0.228600 0.222118 0.187222 0.293490 0.352601 0.399449 0.266244 0.362888 0.330931
chargesum: 0.00000
title: Mulliken charges with hydrogens summed into heavy atoms:
elementType: Cl O O O O N N N N N C C C C C C C C C C C C C C C C C C C C
charge: 0.003189 -0.226694 -0.359681 -0.222118 -0.274671 -0.035116 -0.093100 -0.212828 0.131553 0.061416 -0.012400 0.066660 0.067310 0.140143 0.121940 0.073036 0.299589 0.130944 0.203080 -0.231224 0.047586 0.434468 0.170516 -0.035531 -0.364283 0.020736 0.029852 -0.086795 0.025427 0.126996
polarizability: 3.65811257e+02 4.51472758e+01 4.59725162e+02 -5.40474864e+01 -1.56444376e+00 1.72102186e+02
1716.lowfreq: -6.2586 -1.9307 -0.0011 -0.0003 0.0010 3.7388 7.5880 17.0758 18.1687
frequency: 5.2567 16.8098 17.9858 28.0598 41.4306 53.1305 58.6892 73.2709 84.7942 85.6637 88.2458 100.8291 123.2819 131.6053 154.6817 176.8063 184.5540 203.9869 215.7923 216.9867 228.3023 233.5006 260.3750 275.8311 288.2556 300.8491 305.7000 313.2882 330.0051 344.7528 356.7470 365.0716 373.0261 387.9418 399.8782 408.2608 433.8575 448.9692 453.3606 465.0379 499.7103 515.6909 522.2140 555.0481 562.9080 575.8429 592.0914 604.2644 608.4874 643.8075 664.6511 669.4255 683.5182 705.8685 715.4801 718.4721 739.8400 747.7335 766.7489 773.7262 794.9546 833.1209 842.0401 856.2275 872.4500 879.1590 890.4065 932.1046 933.8954 954.2193 959.6345 982.5868 1002.4202 1034.8509 1036.0515 1040.2659 1069.2588 1072.9858 1079.9820 1087.2473 1090.9525 1101.6034 1126.3126 1132.5641 1151.4281 1154.1333 1173.9708 1182.4947 1214.6733 1226.3194 1237.4361 1253.5127 1262.8699 1271.4446 1293.4167 1330.7532 1336.0356 1344.0563 1351.3035 1353.8655 1365.4669 1373.3044 1383.4643 1394.3493 1398.3178 1417.7074 1438.1052 1445.1113 1453.2236 1458.0846 1460.9421 1461.7938 1467.9549 1469.3589 1471.3602 1474.9483 1475.5268 1483.8131 1485.6072 1515.2117 1528.8508 1548.5294 1561.7419 1578.4161 1587.1505 1594.3029 1617.3007 1631.7191 2843.6247 2845.1917 2863.4755 2963.2577 2984.4977 2991.0866 3017.1170 3019.3243 3026.2572 3044.4217 3068.2207 3077.8163 3078.3802 3082.8792 3115.3162 3142.5829 3161.0715 3180.7074 3331.0222 3442.2437 3512.7772 3635.4067
redmass: 3.3441 4.6611 4.5912 5.1821 5.6588 1.2992 3.0966 3.7755 7.6595 4.6810 5.0832 4.6235 5.6995 7.3950 5.5671 5.8223 4.8309 1.7450 3.4998 3.5008 1.6040 1.5419 3.4443 4.5125 4.6888 8.7478 2.4801 6.4493 6.2800 5.0475 5.0341 2.9101 3.1942 4.6670 5.1954 2.1794 2.5388 5.3393 7.5289 9.6799 5.3981 2.7385 3.1930 5.7350 5.1342 8.7645 4.3185 1.5368 8.9836 1.7930 2.9603 5.9580 7.9666 4.0382 2.6376 4.2436 2.3367 1.9337 5.4307 5.2492 7.8486 1.9407 1.4622 1.1184 2.9115 3.0104 5.0188 1.2098 3.0631 2.5519 4.4197 1.3537 2.1373 1.5194 3.5806 1.4950 2.1929 1.9303 2.0417 1.8188 1.7549 2.5809 1.8593 1.4430 5.1074 1.9979 2.1259 2.3816 1.2962 2.6358 3.2553 2.6146 2.0055 2.0479 1.2755 4.0064 1.7330 3.2379 2.5494 1.7323 1.3761 5.0559 4.5489 2.1334 1.4214 1.1411 1.1547 5.3693 2.5764 1.0858 1.0562 1.8418 1.1195 1.2963 1.4123 1.0597 1.0744 1.0936 1.0550 1.8263 7.4266 6.3526 2.5410 3.3215 2.9289 8.7049 3.8601 8.9107 1.0671 1.0580 1.0601 1.0676 1.0650 1.0378 1.0882 1.0725 1.0723 1.0968 1.0962 1.1007 1.0931 1.1002 1.0995 1.0644 1.0890 1.0963 1.0812 1.0502 1.0883 1.1006
irintensity: 0.2561 0.4995 0.7050 2.7290 1.8500 0.1898 1.1523 0.6549 1.7435 4.7999 0.1663 0.3393 5.0409 9.2939 3.0564 1.8352 4.4445 0.9381 1.2378 0.7683 0.0339 1.3574 5.3312 2.6685 3.1104 3.2644 10.6117 0.1219 6.1777 8.6713 5.8849 2.1864 8.8426 1.8815 41.1616 3.9937 1.0982 9.7527 8.6903 3.3145 2.4150 3.3311 46.0069 0.1006 11.0002 4.6230 7.2443 185.6443 17.9323 138.0445 31.0818 14.9212 8.2235 9.1530 109.9716 1.0832 9.9337 42.8939 5.1697 12.2808 2.7635 8.4481 31.8769 13.7901 4.7659 11.2849 38.6318 120.6500 36.9050 6.2591 46.4465 2.6977 31.7986 15.4871 7.0514 1.3474 24.6163 5.3850 1.2988 12.3321 25.7136 19.6559 1.8011 14.8753 10.7854 20.5707 21.9502 18.9490 37.4520 21.6239 72.1081 34.3307 8.5087 2.2223 2.4740 38.4872 36.3136 44.4110 8.8773 7.6808 7.8363 108.6271 47.7366 10.4031 25.9513 2.4627 2.7136 126.2983 229.1069 6.9463 14.1253 19.0390 17.8951 46.3371 45.0603 9.1455 28.7639 39.9664 7.3944 121.2990 637.7054 1.6837 371.8058 10.7799 146.7839 401.0782 158.0801 37.9254 44.7327 71.7092 272.3973 41.8905 38.5255 10.2198 13.4991 25.9704 36.8740 73.3563 11.2604 29.6125 8.5779 45.3494 2.5624 377.0239 1.6390 1.9940 156.7900 87.4697 156.7934 91.0393
temp: 298.150 k
press: 1.00000 atm
elementType: 17 8 8 8 8 7 7 7 7 7 6 6 6 6 6 6 6 6 6 6 6 6 6 6 6 6 6 6 6 6 1 1 1 1 1 1 1 1 1 1 1 1 1 1 1 1 1 1 1 1 1 1
symmnumber: 1
zpe: 1050391.5 jmol-1
zpe.correction: 0.400073 hartree
zpe.thermalcorrener: 0.429289 hartree
zpe.thermalcorrenthalpy: 0.430233 hartree
zpe.thermalcorrgfe: 0.335986 hartree
zpe.sumelectzpe: -1807.894144 hartree
zpe.sumelectthermal: -1807.864928 hartree
zpe.sumelectthermalent: -1807.863984 hartree
zpe.sumelectthermalfe: -1807.958230 hartree
dipole: 0.6264 -0.3143 0.8115
dipole: 1.0722
quadrupole: -173.3787 -206.0856 -179.9449
quadrupole: -0.7857 3.2133 -0.0769
quadrupole: 13.0910 -19.6158 6.5248 -0.7857 3.2133 -0.0769
hfenergy: -1808.2942166 hartree
pointgroup: C01 [X(C20H22Cl1N5O4)]
dipole: 0.2667371 -0.1499134 0.2904101 debye
polarizability: 351.9780669|36.7990301|460.9959997|-46.0429972|60.2198336|184.6645382 unknown
InChI: InChI=1S/C20H22ClN5O4/c1-9-16(27)13(22)12(20(29)24-7-4-8-26(2)3)15-17(9)30-18-11(21)6-5-10(19(23)28)14(18)25-15/h5-6,24H,4,7-8,22-23H2,1-3H3
charge 0 multiplicity 1
52 atoms
Cl -5.21978 -2.030749 1.092172
O  -3.073516 -0.044779 0.510055
O  2.347831 2.683403 -0.725479
O  -2.03722 4.586944 0.965504
O  0.273331 -4.459076 -2.169728
N  2.055478 0.38141 -0.780629
N  5.117706 0.061601 1.522511
N  -0.545542 -0.490637 -0.685283
N  0.469533 4.208963 0.127823
N  0.749488 -2.214582 -2.507952
C  3.952462 -1.172879 -0.339738
C  0.127941 1.816404 -0.230386
C  -0.836853 0.744911 -0.201867
C  3.468337 0.090203 -1.083369
C  -2.182101 1.025935 0.355315
C  4.090426 -0.951296 1.183547
C  -2.643675 2.261504 0.764385
C  -0.316014 3.112669 0.158157
C  1.574505 1.652788 -0.611263
C  -1.725688 3.385263 0.6511
C  -1.480057 -1.531597 -0.60817
C  -2.733277 -1.319554 0.049014
C  -1.208301 -2.841179 -1.133879
C  -4.033259 2.472477 1.311338
C  -3.658651 -2.361555 0.241525
C  6.499456 -0.432553 1.364922
C  4.902366 0.67719 2.847281
C  -2.148904 -3.871278 -0.917532
C  -3.363126 -3.651725 -0.22925
C  0.003668 -3.234985 -1.956996
H  4.924925 -1.478014 -0.77069
H  3.255051 -2.016935 -0.519484
H  4.068787 0.961546 -0.772431
H  3.598271 -0.038526 -2.177998
H  4.295592 -1.934315 1.681095
H  3.119946 -0.591189 1.575318
H  1.362044 -0.381084 -0.71659
H  -4.216951 3.549976 1.442042
H  -4.156732 1.971911 2.289591
H  -4.798513 2.046099 0.639031
H  7.210123 0.392648 1.550166
H  6.668035 -0.792424 0.335264
H  6.748533 -1.269361 2.067469
H  3.891751 1.120138 2.892096
H  5.635804 1.489276 3.001422
H  5.005956 -0.043493 3.698685
H  -1.899634 -4.861641 -1.310499
H  0.049328 5.09335 0.433989
H  1.444758 4.056899 -0.21504
H  -4.076775 -4.465282 -0.075036
H  0.52099 -1.236961 -2.307344
H  1.522947 -2.466359 -3.122883
