program: Gaussian 09
title: 000149881
version: EM64L-G09RevD.01
frameworkgroup: C1[X(C25H20N4O2S)]
method: RPBEPBE
basis: SDD
operation: Freq
keyword: #p
keyword: freq=noraman
keyword: PBEPBE/SDD
title: #p freq=noraman PBEPBE/SDD
converged: YES YES NO NO
title: Mulliken charges:
elementType: S O O N N N N C C C C C C C C C C C C C C C C C C C C C C C C C H H H H H H H H H H H H H H H H H H H H
charge: 0.926898 -0.533424 -0.534063 -0.499763 -0.048630 -0.449693 -0.696086 0.217152 0.261215 0.229626 -0.034716 -0.115898 0.455668 -0.390360 -0.341934 -0.554262 -0.316050 0.543177 0.240945 -0.453095 -0.453700 -0.319663 -0.267630 -0.255525 -0.346181 -0.237080 -0.112903 -0.258533 -0.226833 -0.203612 -0.209178 -0.220139 0.308764 0.231048 0.265304 0.260273 0.264227 0.221914 0.231836 0.273706 0.231704 0.276148 0.230137 0.257991 0.231758 0.289534 0.285398 0.316492 0.311247 0.240753 0.239622 0.236413
chargesum: 0.00000
title: Mulliken charges with hydrogens summed into heavy atoms:
elementType: S O O N N N N C C C C C C C C C C C C C C C C C C C C C C C C C
charge: 0.926898 -0.533424 -0.534063 -0.190999 -0.048630 -0.191702 -0.068347 0.217152 0.261215 0.229626 -0.034716 -0.115898 0.455668 -0.159312 -0.076630 -0.293988 -0.051823 0.543177 0.240945 -0.231180 -0.221864 -0.045957 -0.035926 0.020623 -0.116044 -0.005322 -0.112903 0.031001 0.058565 0.037141 0.030444 0.016274
polarizability: 6.19451220e+02 -4.13368804e+01 4.18312713e+02 -1.23533632e+01 -3.11518289e+01 2.79873257e+02
1716.lowfreq: -7.2079 -3.3559 -0.0010 0.0002 0.0005 1.7709 6.1320 11.9661 15.3317
frequency: 4.6866 11.7150 15.3228 33.8334 40.0427 50.6221 61.0020 77.4861 90.8761 99.2365 113.8979 123.3275 153.1487 153.6080 173.2874 179.6485 208.0114 216.0955 238.2351 264.7040 280.3631 292.7546 326.3906 328.4640 341.8916 366.7522 368.9566 376.3642 380.1031 399.3019 402.8425 412.0854 418.8240 429.5253 434.0742 457.0891 468.9240 486.1032 496.6387 500.0091 529.2478 542.5219 550.7725 584.1128 586.9916 602.3424 629.2513 638.4504 642.8277 648.4124 657.3554 691.9632 707.6155 726.7009 741.5124 754.5520 758.4946 770.7363 783.7817 788.1697 798.1881 808.7170 816.5458 833.7215 839.1546 851.7452 857.5946 872.8512 877.5429 881.6479 915.1546 931.6675 934.6119 947.8350 948.6174 954.3449 961.2924 965.7913 976.7241 982.4265 992.4141 993.2733 1003.0883 1005.8559 1019.7317 1041.6494 1044.0874 1074.2315 1077.9136 1112.8849 1126.4460 1155.6246 1167.7645 1171.7167 1175.1518 1179.6977 1183.8209 1207.7270 1225.4435 1255.3518 1266.4318 1274.8700 1298.1445 1300.0758 1318.6105 1333.1133 1349.3493 1362.6923 1374.5816 1382.6558 1393.9374 1425.3973 1433.3349 1441.8434 1448.9455 1455.6245 1464.0773 1478.7031 1497.2057 1498.2889 1522.6847 1547.3757 1556.8531 1570.8022 1575.2424 1598.6768 1612.9742 1615.7436 1640.6994 1651.9046 3118.6766 3121.2839 3122.6033 3132.0532 3134.5769 3143.3385 3144.3943 3146.6936 3151.2385 3153.8666 3163.1145 3163.6907 3167.8356 3172.4137 3172.7261 3185.3993 3318.4759 3518.3175 3563.1170 3703.2100
redmass: 6.3708 6.5933 6.1440 4.7628 5.4938 5.2922 5.4145 5.2411 4.6531 4.7884 6.1896 7.2382 4.8838 7.7558 7.3748 5.1182 5.5061 5.8836 9.1157 4.9300 5.0485 4.4818 5.9653 5.1844 5.0306 9.1499 1.1075 4.6958 5.5343 3.4385 2.8601 2.8952 2.7588 4.8730 1.3846 4.2847 2.6641 2.3018 3.4324 3.1424 2.9669 3.3017 4.8999 5.5044 7.0723 6.4738 6.3466 4.2747 4.5326 6.9299 6.2416 2.4869 5.3721 4.0653 3.1986 1.4361 3.6610 1.6708 4.9815 2.2769 6.6976 1.3328 2.2210 1.8230 4.9192 1.2443 5.9681 1.6267 1.7935 1.3390 5.2221 1.3457 7.0959 1.8571 1.4427 1.6759 1.3820 1.3530 6.1074 1.3893 2.6023 1.3599 1.3378 4.6600 2.1698 2.0204 1.4973 1.5559 3.7770 1.4708 1.7364 1.2698 1.2380 1.0574 1.1239 1.2628 1.1313 1.9410 1.5905 2.3626 1.9394 2.1017 3.5761 1.3082 1.7802 2.8247 2.3311 2.2448 3.7233 8.8482 3.8099 5.3480 2.2148 3.6746 2.0256 3.0931 4.5050 2.2813 3.1697 3.5721 7.0709 7.6798 6.8850 3.6466 5.7835 6.8442 6.2108 5.7247 1.5262 2.9059 1.0859 1.0900 1.0902 1.0857 1.0855 1.0965 1.0884 1.0891 1.0924 1.0928 1.0965 1.0950 1.0944 1.0999 1.1014 1.0950 1.0750 1.0749 1.0451 1.1040
irintensity: 1.1742 0.8297 0.1188 0.1762 0.6025 0.1384 0.7349 2.8648 3.0025 10.0170 13.5970 40.6590 33.7260 29.3919 6.3813 11.4798 15.3606 27.2484 5.7595 10.3740 4.4432 20.6099 1.0651 0.2032 3.6053 7.9451 124.0499 2.5634 16.1837 31.4300 1.0346 20.0932 42.4523 47.8240 110.9985 2.6351 26.2346 299.4543 14.0463 54.5935 2.8563 3.9260 14.4870 17.1563 3.6350 0.0062 2.9729 21.9027 1.6630 1.3360 4.4289 28.4465 9.8569 7.8542 4.7890 40.5616 14.6983 76.9409 27.1087 15.0954 107.1512 13.9111 19.4606 67.4402 5.9212 1.2693 2.3388 0.4015 37.2314 122.4323 2.6412 2.0102 35.3314 1.0561 8.4311 5.4036 1.2160 3.3460 11.1322 0.2921 0.6982 0.2972 0.7989 3.8175 8.4880 16.1324 2.3621 5.7366 4.6537 14.3740 4.4430 14.9300 31.0917 0.6148 23.8019 15.1261 68.2529 35.1738 12.5028 16.2100 68.1692 22.2352 88.1444 4.7929 45.6440 39.6663 44.8505 121.4396 107.0228 3.3279 30.6647 226.0610 14.7734 17.1328 14.0992 131.9515 42.9061 123.1123 279.2348 102.3700 41.7496 59.4482 9.7782 83.8470 17.6423 1.4178 534.5641 119.7764 3.0027 536.6814 6.8373 21.8256 3.4081 4.9186 0.9833 24.6969 8.2916 9.2237 17.6752 2.1361 7.3907 20.1040 4.4049 34.5500 28.6487 1.1971 18.4078 45.2124 159.3571 23.5402
temp: 298.150 k
press: 1.00000 atm
elementType: 16 8 8 7 7 7 7 6 6 6 6 6 6 6 6 6 6 6 6 6 6 6 6 6 6 6 6 6 6 6 6 6 1 1 1 1 1 1 1 1 1 1 1 1 1 1 1 1 1 1 1 1
symmnumber: 1
zpe: 1028608.8 jmol-1
zpe.correction: 0.391776 hartree
zpe.thermalcorrener: 0.419700 hartree
zpe.thermalcorrenthalpy: 0.420644 hartree
zpe.thermalcorrgfe: 0.329060 hartree
zpe.sumelectzpe: -1729.822726 hartree
zpe.sumelectthermal: -1729.794803 hartree
zpe.sumelectthermalent: -1729.793859 hartree
zpe.sumelectthermalfe: -1729.885443 hartree
dipole: -6.8019 5.0744 2.9408
dipole: 8.9813
quadrupole: -225.0292 -162.5042 -183.6085
quadrupole: -13.3585 36.5314 -5.1191
quadrupole: -34.6486 27.8765 6.7721 -13.3585 36.5314 -5.1191
hfenergy: -1730.2145028 hartree
pointgroup: C01 [X(C25H20N4O2S1)]
dipole: 2.3997881 2.4968998 -0.7015029 debye
polarizability: 604.3725932|67.2475329|420.9097588|4.4715947|53.4363157|292.3548376 unknown
InChI: InChI=1S/C19H15N4.C6H5O2S/c20-12-5-8-14(9-6-12)22-19-15-3-1-2-4-17(15)23-18-11-13(21)7-10-16(18)19;7-9(8)6-4-2-1-3-5-6/h1-11,20,22H,21H2;1-5H
charge 0 multiplicity 1
52 atoms
S  -5.264262 -1.126004 0.588695
O  -6.688904 -1.872588 0.319674
O  -4.837917 -0.541824 2.054799
N  1.39109 -0.568879 1.562161
N  4.821438 0.619904 -0.763358
N  -3.728361 -2.517714 0.116503
N  4.931914 4.906592 1.497195
C  2.498664 -0.189028 0.750952
C  3.071237 1.103434 0.938354
C  3.09736 -1.095388 -0.183157
C  4.264408 1.459219 0.17016
C  4.251784 -0.614391 -0.940262
C  0.135014 -1.043072 1.148279
C  2.5259 2.091336 1.831902
C  2.664875 -2.453637 -0.371411
C  4.87703 2.734687 0.372107
C  4.859445 -1.493795 -1.905648
C  4.345785 3.662882 1.281287
C  -2.458636 -1.993603 0.411271
C  3.137922 3.32413 2.004878
C  -0.789692 -1.486991 2.143417
C  -0.261593 -1.061884 -0.22334
C  3.293046 -3.280664 -1.299667
C  -2.05781 -1.955812 1.784902
C  -1.542462 -1.506555 -0.575545
C  4.390417 -2.790979 -2.087344
C  -5.165654 0.336811 -0.622613
C  -5.985127 0.304099 -1.764488
C  -4.272059 1.381985 -0.330825
C  -5.894897 1.387824 -2.66877
C  -4.192905 2.453708 -1.250898
C  -4.997763 2.453144 -2.414882
H  1.469175 -0.339087 2.555658
H  1.5916 1.884424 2.365956
H  1.837099 -2.842459 0.228362
H  5.77248 2.955312 -0.217826
H  5.709607 -1.097687 -2.469285
H  2.699015 4.064395 2.685217
H  -0.493921 -1.474893 3.199805
H  0.426898 -0.707226 -0.995127
H  2.954458 -4.314549 -1.426846
H  -2.76327 -2.309703 2.54118
H  -1.845963 -1.492908 -1.630324
H  -3.888678 -2.616118 -0.909074
H  4.866256 -3.451492 -2.820651
H  -6.686734 -0.523009 -1.916974
H  -3.684508 1.36558 0.592683
H  5.775426 5.176903 0.999236
H  4.529933 5.568121 2.154919
H  -6.527504 1.401851 -3.562635
H  -3.509206 3.28628 -1.054396
H  -4.933451 3.288619 -3.120508
