program: Gaussian 09
title: 000101989
version: EM64L-G09RevD.01
frameworkgroup: C1[X(C19H30O)]
method: RPBEPBE
basis: SDD
operation: Freq
keyword: #pfreq=noraman
keyword: PBEPBE/SDD
title: #p freq=noraman PBEPBE/SDD
converged: YES YES NO NO
title: Mulliken charges:
elementType: O C C C C C C C C C C C C C C C C C C C H H H H H H H H H H H H H H H H H H H H H H H H H H H H H H
charge: -0.460335 -0.117311 0.427682 -0.117426 -0.184196 -0.035558 0.374235 -0.544490 -0.498631 -0.489968 -0.525447 -0.499191 -0.516277 -0.567496 -0.870953 -0.501094 -0.082752 -0.299125 -0.801079 -0.230588 0.194261 0.233694 0.218438 0.232231 0.216579 0.216072 0.207883 0.201364 0.193447 0.200946 0.209800 0.197533 0.215607 0.209386 0.216312 0.200086 0.221213 0.214998 0.224942 0.218112 0.218960 0.212879 0.197774 0.196981 0.240881 0.231603 0.215900 0.227363 0.222427 0.332323
chargesum: 0.00000
title: Mulliken charges with hydrogens summed into heavy atoms:
elementType: O C C C C C C C C C C C C C C C C C C C
charge: -0.128012 0.076951 0.427682 0.116268 0.034243 0.196673 0.374235 -0.111838 -0.089384 -0.095574 -0.118114 -0.074199 -0.099879 -0.131285 -0.208940 -0.090441 0.114230 -0.058244 -0.126212 -0.008161
polarizability: 2.29822419e+02 -4.84836177e+00 1.91547824e+02 3.79087557e+00 7.32087454e-01 1.58493869e+02
1716.lowfreq: -7.5264 -0.0005 -0.0003 -0.0001 8.2721 19.5867 47.6124 68.3963 103.0796
frequency: 47.4283 68.3192 103.0116 123.8282 146.0578 160.2689 203.6539 216.1822 226.2392 233.7783 244.1089 252.0069 259.1708 279.3294 291.9026 306.0414 320.2049 348.8736 362.7029 387.0589 398.1806 409.8299 422.1900 429.2576 463.3850 482.6126 502.1195 502.8720 517.2544 549.9342 561.3378 625.4316 687.9026 700.4666 714.7060 735.8056 777.3411 795.3582 799.0376 821.9579 834.0271 856.9997 883.4003 897.7496 913.6195 918.0769 928.2629 934.7074 940.8238 956.4029 958.9342 971.1341 981.0452 989.4688 991.3922 1009.9350 1015.4541 1041.4235 1056.3690 1060.8080 1074.1084 1089.0468 1095.2172 1105.9513 1111.0544 1121.3166 1135.1739 1138.7408 1148.7319 1158.3299 1163.9417 1167.3236 1181.4838 1190.7868 1206.3842 1212.2762 1230.1522 1240.0773 1246.6562 1253.8312 1266.9479 1271.1516 1284.6038 1298.5204 1307.4070 1311.1085 1320.4305 1324.9898 1329.8621 1333.0206 1335.8036 1338.0484 1343.5020 1349.4473 1354.6977 1361.6825 1368.9395 1370.4393 1379.4833 1381.3012 1391.9301 1448.6747 1457.3478 1458.1363 1463.3766 1464.2300 1465.9704 1472.2566 1472.8258 1480.3589 1485.5203 1489.9521 1494.7345 1600.9451 2907.9282 2921.4316 2937.9807 2949.1485 2952.1562 2954.2254 2961.5279 2963.7090 2964.0017 2970.7765 2974.8353 2979.1725 2982.3309 2989.2798 2991.9470 3012.2324 3015.0309 3018.1744 3023.6587 3032.4742 3035.6906 3042.9766 3043.8767 3064.5214 3067.5535 3078.3930 3082.7464 3123.2662 3159.6487 3557.1006
redmass: 3.8475 3.4691 3.6751 1.7004 2.5614 2.2218 3.3383 2.3623 1.4065 2.8400 2.3914 2.2149 2.4386 2.1878 1.1403 2.1755 2.6089 2.2760 2.4194 2.4664 2.1511 2.4290 2.9045 3.0890 3.0416 2.2107 2.6728 2.5321 2.6410 2.6772 2.6801 2.7695 3.0113 3.0790 1.8784 1.7679 3.6584 2.2332 2.1517 2.7784 1.8490 2.1699 2.1260 1.7031 1.7961 1.9329 1.9738 1.5997 1.6049 1.9048 1.9427 1.8953 1.8234 2.0600 2.2407 1.8348 1.9352 2.0579 1.8419 2.0571 2.0611 1.4226 1.7816 1.5123 1.4670 2.2045 2.2035 1.4031 1.7697 1.5395 1.7092 1.7492 1.7651 2.2990 1.6314 1.5959 1.7131 1.3621 1.6108 1.3702 1.6044 1.6840 1.3157 1.2976 1.3243 1.4494 1.3604 1.4281 1.4977 1.4057 1.4012 1.3811 1.4351 1.5163 1.5793 1.4762 1.4782 1.3650 1.2091 1.5822 1.2405 1.0851 1.0798 1.0730 1.0860 1.0928 1.0932 1.0857 1.0881 1.0668 1.0614 1.0609 1.0555 6.2918 1.0816 1.0798 1.0807 1.0633 1.0793 1.0662 1.0594 1.0626 1.0634 1.0801 1.0625 1.0371 1.0402 1.0612 1.0611 1.0974 1.0980 1.0985 1.1016 1.0945 1.1005 1.1008 1.1006 1.0974 1.0981 1.0973 1.0984 1.0862 1.1059 1.0660
irintensity: 0.0839 0.2343 2.3897 0.4922 0.5785 0.2805 0.8934 0.3470 0.3425 0.9533 0.0779 0.0447 4.9449 5.8931 144.3006 4.2480 0.2609 0.3685 1.4240 1.7822 0.4066 6.0806 0.5912 0.8450 9.1290 2.5040 0.9806 1.0316 1.5515 1.0383 3.1601 2.9735 3.9049 1.3720 29.0722 29.3960 0.2574 1.5897 0.6976 7.3836 7.6663 7.7155 3.3335 6.4539 3.9169 11.1766 3.9847 7.1266 6.8258 4.8934 3.7824 6.1308 2.9881 3.8966 28.5551 2.8937 4.6964 22.7769 1.8403 2.2961 0.3479 3.3954 20.3008 11.2650 2.0009 3.8308 5.3309 6.7786 3.1372 3.0993 2.6043 8.3698 4.1463 1.8547 11.2408 9.1207 0.7021 12.7680 5.4826 3.8978 1.7971 3.1581 2.9210 2.0418 1.4848 0.7919 4.6636 4.2076 2.4073 2.0762 1.1098 2.4306 2.3384 0.9941 3.2871 1.4881 7.2791 2.8658 16.9364 3.4201 26.8202 7.3434 4.5199 4.1209 11.1934 2.9495 17.4019 14.0503 4.0571 2.8094 12.2594 4.3031 3.3667 3.9104 8.9437 14.6570 54.0634 20.4592 7.2372 34.5499 64.9026 49.5620 45.0071 26.1465 53.9152 30.4406 8.0215 33.4216 74.4327 44.3022 25.8174 37.6723 48.0417 30.6248 65.4576 23.8452 106.3415 41.1163 28.7311 41.3340 37.2167 8.3119 49.4777 2.2521
temp: 298.150 k
press: 1.00000 atm
elementType: 8 6 6 6 6 6 6 6 6 6 6 6 6 6 6 6 6 6 6 6 1 1 1 1 1 1 1 1 1 1 1 1 1 1 1 1 1 1 1 1 1 1 1 1 1 1 1 1 1 1
symmnumber: 1
zpe: 1177862.3 jmol-1
zpe.correction: 0.448624 hartree
zpe.thermalcorrener: 0.467243 hartree
zpe.thermalcorrenthalpy: 0.468187 hartree
zpe.thermalcorrgfe: 0.404659 hartree
zpe.sumelectzpe: -815.652938 hartree
zpe.sumelectthermal: -815.634319 hartree
zpe.sumelectthermalent: -815.633375 hartree
zpe.sumelectthermalfe: -815.696902 hartree
dipole: 0.9373 -1.4092 0.7688
dipole: 1.8589
quadrupole: -119.7918 -122.5662 -125.1174
quadrupole: -7.2285 0.9037 3.1671
quadrupole: 2.7000 -0.0744 -2.6256 -7.2285 0.9037 3.1671
hfenergy: -816.1015617 hartree
pointgroup: C01 [X(C19H30O1)]
dipole: -0.371625 -0.5511453 -0.3049958 debye
polarizability: 229.8872148|4.7952062|191.5571604|3.2094234|-0.4285326|158.4197368 unknown
InChI: InChI=1S/C19H30O/c1-18-9-3-4-16(18)15-6-5-13-12-14(20)7-11-19(13,2)17(15)8-10-18/h3,9,13-17,20H,4-8,10-12H2,1-2H3
charge 0 multiplicity 1
50 atoms
O  -4.472393 0.343674 1.654016
C  0.004373 -0.459081 0.242907
C  -1.454995 -0.432144 -0.356468
C  0.897099 0.708179 -0.312601
C  2.274479 0.593753 0.364381
C  -2.067024 0.981349 -0.030791
C  2.999556 -0.758142 0.047555
C  0.697856 -1.852776 0.142783
C  0.229586 2.07996 -0.053733
C  -1.214568 2.137759 -0.598712
C  2.158019 -1.889832 0.683055
C  -2.345353 -1.490855 0.369063
C  -3.553293 1.098131 -0.441588
C  3.381661 1.670461 0.189416
C  -1.438925 -0.726416 -1.882833
C  -3.839709 -1.401087 -0.017353
C  -4.424648 0.010167 0.207054
C  4.386234 -0.455774 0.627532
C  3.197699 -1.022332 -1.478626
C  4.614089 0.887626 0.654088
H  -0.115561 -0.243926 1.33165
H  1.021216 0.590233 -1.409253
H  2.083535 0.564759 1.462087
H  -2.0455 1.071404 1.077232
H  0.698143 -2.197571 -0.908982
H  0.102624 -2.594748 0.707939
H  0.843092 2.88499 -0.504444
H  0.210024 2.267543 1.041383
H  -1.682369 3.105465 -0.326743
H  -1.202246 2.097569 -1.707659
H  2.15183 -1.760615 1.78457
H  2.599591 -2.8859 0.475307
H  -2.248854 -1.339315 1.463664
H  -1.98349 -2.51286 0.146647
H  -3.944386 2.086529 -0.132967
H  -3.664933 1.037557 -1.542148
H  3.196321 2.579633 0.790457
H  3.493355 2.00017 -0.866221
H  -0.728716 -0.078898 -2.425411
H  -1.150021 -1.775694 -2.077564
H  -2.431072 -0.574289 -2.343723
H  -3.975474 -1.671734 -1.083357
H  -4.424782 -2.143846 0.564543
H  -5.456732 0.056928 -0.20511
H  5.117343 -1.233458 0.877635
H  3.696867 -0.167127 -1.968414
H  3.841191 -1.910713 -1.622768
H  2.245814 -1.210305 -2.004664
H  5.555825 1.36809 0.941149
H  -4.995476 -0.356993 2.120019
