program: Gaussian 09
title: 000102270
version: EM64L-G09RevD.01
frameworkgroup: C1[X(C31H20N2O5S)]
method: RPBEPBE
basis: SDD
operation: Freq
keyword: #p
keyword: freq=noraman
keyword: PBEPBE/SDD
title: #p freq=noraman PBEPBE/SDD
converged: YES YES NO NO
title: Mulliken charges:
elementType: S O O O O O N N C C C C C C C C C C C C C C C C C C C C C C C C C C C C C C C H H H H H H H H H H H H H H H H H H H H
charge: 0.915242 -0.350651 -0.448079 -0.514063 -0.496926 -0.214426 -0.013114 0.031919 0.318563 -0.671803 0.268748 0.204275 0.101041 0.206648 0.433316 0.442089 0.158955 -0.330788 -0.467174 -0.282513 -0.351282 0.521871 -0.440860 -0.390339 -0.462137 -0.400865 0.228440 -0.464021 -0.276114 -0.225890 -0.237415 -0.262161 -0.349993 -0.394481 -0.263438 -0.224938 -0.162720 -0.401632 0.232172 0.229028 0.235756 0.256296 0.241081 0.232770 0.245183 0.223387 0.239452 0.215457 0.244308 0.230860 0.313598 0.232820 0.226206 0.282589 0.292772 0.229499 0.248515 0.254562 0.360401
chargesum: 0.00000
title: Mulliken charges with hydrogens summed into heavy atoms:
elementType: S O O O O O N N C C C C C C C C C C C C C C C C C C C C C C C C C C C C C C C
charge: 0.915242 -0.350651 -0.087678 -0.514063 -0.496926 -0.214426 -0.013114 0.031919 0.318563 -0.207018 0.268748 0.204275 0.101041 0.206648 0.433316 0.442089 0.158955 -0.074492 -0.226093 -0.282513 -0.118512 0.521871 -0.195677 -0.166952 -0.222685 -0.185407 0.228440 -0.219713 -0.045255 0.087708 -0.004595 -0.035955 -0.067404 -0.101709 -0.033938 0.023577 -0.162720 -0.147070 0.232172
polarizability: 7.39533580e+02 5.82694029e+01 4.73150875e+02 -8.88416604e+00 2.71113107e+01 2.75771491e+02
1716.lowfreq: -14.6783 -5.2074 -3.8668 -0.0057 0.0011 0.0014 7.1585 11.5456 20.7081
frequency: -2.5137 11.1701 20.6855 26.6684 41.9151 42.7014 53.0833 61.0099 66.4915 78.5181 80.9917 89.4812 97.8279 124.3359 131.3752 146.7348 147.7601 153.1655 176.9165 193.2594 207.8801 215.5554 221.1671 231.2948 234.8817 257.8718 293.7273 313.1050 320.5152 324.1672 330.4905 348.1234 354.3570 378.9304 391.2140 395.5316 401.9749 412.2778 427.7094 437.3842 442.7191 447.8516 451.8546 474.8380 485.1365 492.2187 514.6810 523.4482 525.1895 533.9075 535.9753 541.1466 545.6589 557.2250 576.8120 589.4265 624.3770 628.2442 657.3900 669.7742 679.2410 687.5741 693.0729 706.9054 722.6675 740.6876 744.4268 750.2111 759.7774 776.4127 778.9959 796.2871 799.4500 804.4819 806.2137 828.6666 839.4682 846.5098 850.2119 852.7185 861.3758 869.3181 880.2614 905.0519 923.3773 934.3051 934.6338 954.2568 956.0431 958.4073 962.7949 972.9954 985.1884 989.9738 992.2634 1008.3128 1032.5775 1036.9127 1042.2328 1066.3604 1067.4408 1087.3555 1144.9131 1148.8939 1152.0168 1161.5093 1171.0431 1175.5759 1177.8312 1190.0172 1207.5132 1217.1356 1227.2514 1231.9831 1234.7630 1238.6220 1250.2010 1253.6557 1263.9488 1268.9221 1275.7738 1292.2354 1314.2941 1356.3664 1364.5744 1376.9144 1394.5757 1396.8748 1401.4136 1402.5612 1422.2712 1426.5586 1430.6173 1434.5900 1439.3434 1460.7643 1465.5922 1471.2564 1503.5026 1517.0822 1527.2815 1540.6756 1544.1807 1589.7203 1597.0512 1603.1007 1603.7857 1609.1644 1618.7631 1635.1775 2035.3602 3028.7770 3077.1686 3113.9688 3116.8804 3124.9485 3131.3621 3133.4761 3138.6947 3145.1153 3147.9106 3150.2186 3156.7038 3158.0146 3158.9394 3163.4575 3175.7242 3175.8373 3176.2442 3188.7341 3587.2457
redmass: 7.6183 7.8798 6.2797 5.4909 5.9768 6.2205 7.4684 5.9545 8.3417 7.6835 6.8453 6.0311 12.2403 4.7490 6.2595 10.5654 6.1567 6.6461 5.9558 7.0940 5.4970 4.1838 5.3965 9.1058 7.7950 5.8049 4.4947 2.4788 3.0522 3.9851 1.6858 5.3823 6.2658 7.2918 9.7548 10.0555 3.7564 3.0798 7.3976 11.6701 4.5140 4.2169 5.8292 4.0421 7.2481 6.9957 4.8076 5.9148 3.3744 4.3994 3.8655 3.8335 3.8426 6.7013 3.8576 6.6939 4.4083 7.0101 3.7899 3.4543 7.2354 3.4381 4.9845 5.6356 5.3909 4.2618 6.8102 1.4108 1.4558 1.8452 2.5080 2.9745 1.9334 1.8939 2.2914 1.9891 3.2184 3.4012 2.7846 5.0583 4.6246 1.8173 1.7578 15.9314 5.7367 7.2659 1.3438 1.3532 1.3534 1.4105 1.3807 1.3879 1.3540 2.6861 1.5628 1.3780 2.2575 2.3681 3.3744 2.9355 2.1267 3.2614 1.4431 1.5212 1.3973 1.1784 1.3782 1.1421 1.1705 1.3819 1.6920 2.7623 1.7205 2.5337 1.9741 1.7547 3.9724 1.8300 1.6693 4.4704 1.5948 2.3771 1.4229 3.3036 2.5810 7.0079 3.6615 2.2336 2.9220 3.2704 3.7889 3.1946 2.5217 2.8396 2.2779 1.2370 3.4504 2.5478 3.2480 3.7381 7.1117 8.9143 6.3760 7.7257 6.0803 6.6283 7.6014 5.7242 6.3289 6.6424 13.8622 1.0596 1.0971 1.0874 1.0863 1.0867 1.0884 1.0894 1.0898 1.0969 1.0942 1.0876 1.0898 1.0959 1.0919 1.0996 1.0990 1.0965 1.0960 1.0964 1.0661
irintensity: 0.2160 0.2447 0.0636 0.2656 0.2876 1.0956 0.7803 0.3520 0.2120 9.4544 9.6514 11.6587 1.3443 4.1160 2.5356 4.8358 4.1154 6.7001 6.9624 38.4442 1.0809 18.2423 2.7912 3.0758 2.5017 1.0977 9.4174 26.5975 5.3685 15.6462 74.7082 33.0278 19.1159 5.1020 28.2828 111.7840 8.3907 7.8942 1.6234 0.6911 0.3907 7.1652 10.3975 14.9057 3.8437 40.3976 4.7151 2.5883 1.4153 11.3984 16.6656 8.3099 7.3837 2.9928 2.3429 5.6246 1.7791 25.1628 4.5027 0.2306 1.3389 2.6472 7.2775 1.0273 6.5649 4.6085 3.5794 45.0134 52.1036 16.8909 6.8560 2.2195 3.5136 156.3183 36.6630 40.4231 21.3998 0.0479 30.7535 7.6339 0.7799 4.4578 14.1590 61.6747 24.8911 33.1094 1.7043 0.4559 0.1617 3.0577 1.3013 2.2585 0.3948 26.0096 5.5730 2.7554 0.8513 3.6526 34.1178 4.5167 4.2178 3.9966 44.6732 5.7631 1.9799 34.0604 28.9884 2.5407 11.6787 13.5287 13.2611 68.1658 6.4914 10.7085 8.3837 5.3149 80.2014 8.4686 4.4432 138.6982 3.0943 7.5004 1.3218 32.8584 11.1213 27.5944 26.6896 49.5841 5.8477 4.0007 5.4367 28.5702 18.2142 17.6081 12.9933 10.4626 17.1625 9.6800 28.1188 23.0797 89.6371 118.2835 46.2948 3.4026 7.8886 281.4446 5.9833 4.6835 69.2594 35.2666 883.2776 17.1683 7.6407 9.3698 3.2881 2.1333 5.4608 8.0231 13.3498 17.9329 36.1045 5.3182 4.7996 50.2520 9.4455 17.9269 14.1898 21.6450 15.1068 13.8013 47.1537
temp: 298.150 k
press: 1.00000 atm
elementType: 16 8 8 8 8 8 7 7 6 6 6 6 6 6 6 6 6 6 6 6 6 6 6 6 6 6 6 6 6 6 6 6 6 6 6 6 6 6 6 1 1 1 1 1 1 1 1 1 1 1 1 1 1 1 1 1 1 1 1
symmnumber: 1
zpe: 1118282.2 jmol-1
zpe.correction: 0.425931 hartree
zpe.thermalcorrener: 0.458236 hartree
zpe.thermalcorrenthalpy: 0.459180 hartree
zpe.thermalcorrgfe: 0.360845 hartree
zpe.sumelectzpe: -2074.146162 hartree
zpe.sumelectthermal: -2074.113857 hartree
zpe.sumelectthermalent: -2074.112913 hartree
zpe.sumelectthermalfe: -2074.211248 hartree
dipole: -4.3395 -0.2399 -0.9959
dipole: 4.4588
quadrupole: -223.6784 -199.4500 -239.5510
quadrupole: 5.2544 1.2843 4.2603
quadrupole: -2.7853 21.4431 -18.6578 5.2544 1.2843 4.2603
hfenergy: -2074.572093 hartree
pointgroup: C01 [X(C31H20N2O5S1)]
dipole: 1.629765 -0.5084176 -0.4033194 debye
polarizability: 747.2015916|-34.6713264|445.3055576|-23.5111588|-61.4305801|295.9487963 unknown
InChI: InChI=1S/C21H15O2.C10H5N2O3S/c22-20-11-9-14-5-1-3-7-16(14)18(20)13-19-17-8-4-2-6-15(17)10-12-21(19)23;11-12-8-5-4-6-7(10(8)13)2-1-3-9(6)16(14)15/h1-12,22H,13H2;1-5H
charge 0 multiplicity 1
59 atoms
S  -0.30741 0.699442 1.741123
O  0.550767 0.744936 -0.219739
O  3.667362 -2.070002 1.060998
O  -0.010924 2.176831 2.383824
O  0.000068 -0.608223 2.669468
O  -6.136626 2.251888 -0.979354
N  -4.930811 4.701303 -1.395399
N  -5.693939 5.413493 -1.936764
C  2.775121 -0.019126 -0.774936
C  2.188428 -1.364026 -1.196094
C  1.576303 -2.239042 -0.100212
C  4.162534 0.322461 -0.97335
C  1.889515 0.994962 -0.289449
C  0.254474 -2.812305 -0.208751
C  4.629444 1.660633 -0.643469
C  -0.216684 -3.731474 0.816064
C  2.359404 -2.5920 1.009946
C  2.372276 2.311954 0.054365
C  3.70661 2.632229 -0.120366
C  -2.100505 0.563667 1.133245
C  5.135314 -0.617548 -1.464988
C  -2.763631 1.656694 0.503085
C  6.003316 2.000964 -0.838758
C  -0.640583 -2.526485 -1.29798
C  0.625268 -4.032722 1.933059
C  1.892525 -3.47098 2.032811
C  -4.120427 1.400661 0.085572
C  -1.513334 -4.332393 0.696495
C  6.473345 -0.258749 -1.643252
C  -2.674538 -0.695401 1.33607
C  6.915281 1.064153 -1.335581
C  -1.897755 -3.128497 -1.389829
C  -2.160323 2.958753 0.272772
C  -4.723364 0.134079 0.304155
C  -2.342664 -4.048257 -0.389545
C  -4.013692 -0.906242 0.92363
C  -4.937571 2.442391 -0.593585
C  -2.864872 3.963572 -0.351077
C  -4.224384 3.740493 -0.786404
H  2.964685 -1.958594 -1.707233
H  1.417803 -1.154587 -1.955639
H  1.651283 3.033872 0.448164
H  4.078166 3.63233 0.130571
H  4.833973 -1.645348 -1.680259
H  6.333602 3.016149 -0.589134
H  -0.346698 -1.811733 -2.071632
H  0.259589 -4.713286 2.710052
H  2.538985 -3.700533 2.889651
H  -1.838411 -5.031668 1.476772
H  7.191083 -0.997089 -2.01659
H  -2.092111 -1.493655 1.80742
H  7.965656 1.337764 -1.483157
H  -2.554193 -2.887449 -2.233295
H  -1.141461 3.141379 0.61871
H  -5.756488 0.000301 -0.031542
H  -3.32521 -4.524117 -0.481094
H  -4.476869 -1.884229 1.082224
H  -2.409659 4.943684 -0.523167
H  4.093155 -2.26728 1.931177
