program: Gaussian 09
title: 000101945
version: EM64L-G09RevD.01
frameworkgroup: C1[X(C8H12)]
method: RPBEPBE
basis: SDD
operation: Freq
keyword: #p
keyword: freq=noraman
keyword: PBEPBE/SDD
title: #p freq=noraman PBEPBE/SDD
converged: YES YES NO NO
title: Mulliken charges:
elementType: C C C C C C C C H H H H H H H H H H H H
charge: -0.475076 -0.463443 -0.126168 0.002394 -0.229760 -0.586280 -0.073738 -0.592826 0.211060 0.206910 0.209898 0.206313 0.212876 0.205400 0.224007 0.214785 0.213977 0.212963 0.213209 0.213501
chargesum: 0.00000
title: Mulliken charges with hydrogens summed into heavy atoms:
elementType: C C C C C C C C
charge: -0.057106 -0.047232 0.086708 0.207793 -0.005753 -0.157519 0.139225 -0.166116
polarizability: 1.23103686e+02 -1.68867362e+01 8.02902746e+01 1.44706256e+01 2.80955421e+00 7.24107485e+01
1716.lowfreq: -17.0078 -4.4248 0.0003 0.0003 0.0005 13.2556 35.7255 70.2687 78.7762
frequency: 34.3766 70.2442 78.6475 144.5827 168.6242 229.3566 276.2061 360.7009 425.9824 438.8799 496.3548 623.7494 645.3977 802.9576 853.8611 887.0511 925.0562 931.3394 942.0210 955.7508 959.4781 995.4372 1015.2158 1017.6760 1039.8932 1124.8290 1188.2543 1198.6209 1214.3245 1264.9601 1279.0709 1286.5689 1298.4781 1316.2991 1331.9507 1426.2377 1430.5861 1455.1855 1459.7975 1615.8271 1660.6038 1668.2700 2951.7561 2966.5074 3016.3454 3033.5034 3070.4866 3073.6941 3079.7760 3090.8088 3091.2569 3097.9813 3194.4446 3203.2546
redmass: 2.9013 2.1948 2.0202 2.6232 3.0017 2.1328 2.1770 2.1098 2.2888 2.3411 2.5487 1.4451 1.3746 1.8052 1.8889 1.5894 1.3136 1.6446 1.3751 1.2638 1.4246 1.2233 1.2353 1.8738 1.6061 2.1060 2.0366 1.1764 1.5348 1.2812 1.3920 1.2155 1.2494 1.3069 1.4112 1.1797 1.2503 1.0898 1.1142 4.2543 4.7774 5.8518 1.0615 1.0626 1.0979 1.0970 1.0910 1.0789 1.0835 1.0754 1.0763 1.0813 1.1144 1.1143
irintensity: 0.0283 0.0807 0.0524 1.3503 0.7051 1.0277 1.0456 0.2998 0.5664 1.6779 1.3022 15.3008 2.4921 7.4250 1.9112 5.4384 45.2858 12.4386 90.0634 40.0936 10.9493 11.1681 56.0904 3.2600 20.0796 1.8048 0.4387 0.0799 3.1837 0.2505 1.0590 0.7904 2.1461 0.4287 2.0795 7.3946 2.9656 21.6450 3.5551 9.7044 14.6484 18.7722 19.4987 76.0304 6.7008 31.5148 6.3069 39.9233 0.8230 43.5521 11.4779 11.4311 28.3198 26.5637
temp: 298.150 k
press: 1.00000 atm
elementType: 6 6 6 6 6 6 6 6 1 1 1 1 1 1 1 1 1 1 1 1
symmnumber: 1
zpe: 451043.1 jmol-1
zpe.correction: 0.171793 hartree
zpe.thermalcorrener: 0.181454 hartree
zpe.thermalcorrenthalpy: 0.182398 hartree
zpe.thermalcorrgfe: 0.135967 hartree
zpe.sumelectzpe: -311.364607 hartree
zpe.sumelectthermal: -311.354946 hartree
zpe.sumelectthermalent: -311.354002 hartree
zpe.sumelectthermalfe: -311.400434 hartree
dipole: 0.5779 -0.6388 0.0296
dipole: 0.8619
quadrupole: -52.3120 -50.8466 -45.4356
quadrupole: -2.8387 0.7839 0.9109
quadrupole: -2.7806 -1.3152 4.0958 -2.8387 0.7839 0.9109
hfenergy: -311.5364005 hartree
pointgroup: C01 [X(C8H12)]
dipole: 0.2312514 0.2479961 -0.0033382 debye
dipolederiv: -0.0116091 -0.0537496 -0.0138925 -0.0680326 0.0957191 -0.0432899 0.0775413 0.0709484 0.1243299 0.1550371 0.0206519 0.0306951 0.0195943 -0.0194194 0.0417016 -0.0844304 -0.0482374 0.1261345 0.1276294 0.1391954 -0.0118389 0.2596829 -0.1772756 0.0466571 0.0403255 0.0119438 0.1326441 -0.249541 -0.0087504 -0.0564012 -0.1594907 0.2376849 -0.005706 0.033369 -0.0753186 0.125856 -0.1749741 0.0327467 -0.0225138 0.0012459 -0.1284134 0.0229269 0.0251809 0.0682738 0.0940141 -0.4278542 -0.0032665 -0.0625039 0.0454359 -0.1472456 -0.0946731 -0.0855725 -0.1087702 0.0643759 0.2665849 0.1447273 -0.0464793 0.1816101 -0.0298692 0.0195049 0.12217 0.0644459 0.1232277 -0.362997 0.0783376 0.0551215 0.0528159 -0.3969397 0.1086932 0.0310014 0.1033173 0.0841774 -0.045034 -0.0334636 0.0112334 -0.0524722 -0.1927864 0.0534193 -0.0572278 0.0684762 0.0696065 0.0050999 -0.0001667 0.0394578 -0.0050809 0.0934164 0.0218798 -0.0151165 -0.0523539 -0.1641607 -0.1417354 -0.1030526 -0.0464497 -0.0786153 -0.0766932 -0.0469908 -0.1001203 -0.027248 0.0625675 0.0783303 0.0336589 0.0088115 0.0430915 0.0357127 -0.0294103 0.0483839 0.0358745 -0.1656984 0.0586681 -0.0429163 0.0022276 -0.0676537 0.1267334 -0.0545529 -0.0214335 -0.0454172 -0.1293936 0.1498809 -0.0027073 0.0648631 0.0224814 0.0323676 -0.0004479 0.0390256 0.0410046 -0.135736 0.0634002 -0.0483512 0.0032591 -0.0512182 0.1314555 -0.0350412 -0.0380926 -0.0518094 -0.1204665 0.1939567 0.0214452 0.0144416 0.0655126 -0.0960168 0.0717778 0.0149538 0.0849237 0.0434955 0.1843442 0.013184 0.0388911 -0.000626 0.0747839 0.0485899 0.0503309 0.0068416 -0.1176355 0.0655755 -0.0336167 0.0564247 -0.0506389 0.13178 -0.0203399 -0.0369268 -0.0527516 -0.1292284 -0.0346373 -0.1049215 -0.0561843 -0.1129595 0.134421 -0.0507289 -0.0675082 -0.0554909 0.033237 0.0998751 -0.0489849 -0.009163 -0.0446824 0.1705847 -0.0539695 0.0241466 -0.0386527 -0.121347 unknown
polarizability: 123.2257894|16.9078122|79.4712068|-14.3694746|3.1267993|73.1077131 unknown
InChI: InChI=1S/C8H12/c1-3-5-7-8-6-4-2/h3-5,7H,1-2,6,8H2
charge 0 multiplicity 1
20 atoms
C  0.879671 1.443876 0.221446
C  2.223185 0.733944 -0.136204
C  -0.32951 0.788653 -0.403518
C  2.327681 -0.667008 0.429808
C  -1.444582 0.378162 0.271017
C  2.633656 -1.782506 -0.278354
C  -2.604219 -0.244931 -0.369994
C  -3.729582 -0.653272 0.28575
H  0.952416 2.49578 -0.12842
H  0.761595 1.483385 1.322182
H  3.05152 1.354763 0.265656
H  2.349472 0.706386 -1.236026
H  -0.288101 0.639533 -1.495093
H  2.13718 -0.757623 1.511586
H  -1.493142 0.514067 1.36236
H  2.699937 -2.766832 0.198686
H  2.821844 -1.743789 -1.358819
H  -2.541063 -0.384591 -1.460192
H  -4.568808 -1.1161 -0.243841
H  -3.835149 -0.533697 1.37137
