program: Gaussian 09
title: 000101924
version: EM64L-G09RevD.01
frameworkgroup: C1[X(C10H9NO3)]
method: RPBEPBE
basis: SDD
operation: Freq
keyword: #p
keyword: freq=noraman
keyword: PBEPBE/SDD
title: #p freq=noraman PBEPBE/SDD
converged: YES YES NO NO
title: Mulliken charges:
elementType: O O O N C C C C C C C C C C H H H H H H H H H
charge: -0.223203 -0.206020 -0.204618 0.027550 0.513706 -0.353193 -0.368378 0.378491 -0.364840 -0.368803 -0.259075 -0.284230 0.187932 -0.781845 0.239108 0.252096 0.288596 0.290608 0.276861 0.223375 0.237727 0.260222 0.237933
chargesum: 0.00000
title: Mulliken charges with hydrogens summed into heavy atoms:
elementType: O O O N C C C C C C C C C C
charge: -0.223203 -0.206020 -0.204618 0.027550 0.513706 -0.114085 -0.116282 0.378491 -0.076244 -0.078195 0.017786 -0.060855 0.187932 -0.045963
polarizability: 2.77830192e+02 4.82927821e+00 1.29695457e+02 5.34357208e-02 5.67295400e-02 5.35238012e+01
1716.lowfreq: -8.8650 -3.7761 -2.9711 -0.0003 0.0009 0.0009 32.0957 52.1560 67.0207
frequency: 31.9124 52.1372 67.0147 75.8212 100.7116 126.4304 166.6662 191.1646 223.3017 297.6271 322.2849 397.2338 410.1399 468.1463 481.3087 515.5055 562.2134 567.2012 627.9069 651.4223 665.0897 739.6117 769.3579 828.1948 843.9353 849.3911 892.1333 906.0453 959.4854 989.1170 996.4031 1002.3727 1015.9207 1030.2621 1092.9048 1110.6984 1177.8950 1186.8940 1212.7169 1222.5762 1291.7331 1310.4176 1318.2832 1363.9925 1368.6499 1403.0155 1421.0084 1442.0436 1454.3282 1482.7702 1568.2222 1585.8083 1607.2880 1650.0925 2978.0165 3059.5018 3097.3091 3120.8951 3127.4615 3146.0184 3154.5665 3183.9344 3186.6238
redmass: 4.2779 8.4146 6.7422 5.3712 1.0613 3.1872 3.9482 8.4964 7.2773 4.2850 4.0112 5.5376 2.8383 5.0277 2.8301 5.4350 5.2553 2.7208 7.0654 6.6484 4.3195 3.9495 8.2780 5.8282 1.3001 1.4987 1.7839 3.1306 1.9116 1.3209 1.3712 3.0120 1.2925 1.6615 3.2292 1.3381 1.7751 1.7970 2.1649 2.7799 1.5240 2.1980 1.3390 5.8948 1.3067 7.2812 3.7507 1.0933 1.0501 2.4603 7.1740 7.4432 6.1708 5.7499 1.0379 1.0963 1.0902 1.0913 1.0989 1.0907 1.0894 1.0950 1.0958
irintensity: 1.1387 7.3273 0.3609 3.8209 0.0130 0.7462 0.1844 3.2634 1.0817 3.9302 1.0802 5.7877 0.0270 1.2903 9.8919 2.1174 22.5761 0.7383 0.5272 7.9599 23.6307 5.1630 35.8952 3.6612 4.7052 49.8778 5.1918 6.3990 46.1159 17.6237 0.0824 2.5664 45.2551 0.8748 20.2179 16.7310 235.7514 6.4492 258.8947 168.5802 9.7884 133.1008 0.9944 84.8260 117.8056 31.0002 45.3273 25.4961 21.6190 10.2784 165.8969 8.2289 60.2604 65.7328 2.4488 12.8140 0.2742 7.4795 21.4995 6.4798 5.6812 0.1856 2.4856
temp: 298.150 k
press: 1.00000 atm
elementType: 8 8 8 7 6 6 6 6 6 6 6 6 6 6 1 1 1 1 1 1 1 1 1
symmnumber: 1
zpe: 443510.3 jmol-1
zpe.correction: 0.168924 hartree
zpe.thermalcorrener: 0.182001 hartree
zpe.thermalcorrenthalpy: 0.182945 hartree
zpe.thermalcorrgfe: 0.127451 hartree
zpe.sumelectzpe: -665.790035 hartree
zpe.sumelectthermal: -665.776958 hartree
zpe.sumelectthermalent: -665.776014 hartree
zpe.sumelectthermalfe: -665.831508 hartree
dipole: -3.6084 -2.1117 0.0036
dipole: 4.1809
quadrupole: -112.9657 -76.4591 -82.2819
quadrupole: 16.5429 -0.0813 0.0077
quadrupole: -22.3968 14.1098 8.2870 16.5429 -0.0813 0.0077
hfenergy: -665.9589592 hartree
pointgroup: C01 [X(C10H9N1O3)]
dipole: -1.4083076 0.8476717 -0.061538 debye
dipolederiv: -0.9935728 -0.03558 -0.0074231 -0.4809718 -0.7418847 0.0171072 0.0147343 0.0226514 -0.3113955 -0.8016702 -0.1876839 0.0018934 -0.3458789 -0.698843 0.0172206 0.0098459 0.0195628 -0.2296884 -0.9138202 0.200138 -0.0172038 0.3082662 -0.6233442 0.0217047 -0.0218127 0.0203346 -0.229117 2.2514657 0.0356368 0.0224369 0.1188095 1.0870926 -0.039145 0.0170625 -0.0406375 0.1944218 0.2942808 -0.0391613 0.0052386 -0.0659356 0.0600615 -0.0013317 0.0079386 -0.0013672 0.0447661 -0.2872127 -0.1698575 0.0055931 -0.1945768 -0.0086003 -0.0074876 0.0063531 -0.0073195 -0.1225086 -0.3666512 0.1950871 -0.0122433 0.1388307 0.0795474 -0.0093611 -0.0091454 -0.0085363 -0.1475044 -1.0094595 -0.0483843 -0.0107031 -0.1656759 0.0687585 -0.0031227 -0.0041589 -0.0014322 0.0526724 0.206054 0.1508757 -0.003421 -0.0919148 -0.033579 -0.0040258 0.0078023 -0.0011933 -0.0979833 0.281035 -0.1481476 0.0115881 0.1717988 -0.0445749 -0.0003436 -0.0037063 -0.003882 -0.0925428 0.3530565 -0.0048092 0.0057732 0.0011073 0.1390696 -0.010679 0.0050205 -0.0104627 -0.0654325 -1.3281881 0.1364189 -0.0223616 0.2688227 0.0201698 -0.0073956 -0.0295299 -0.0090776 -0.1995703 2.2116653 -0.2471541 0.0419996 0.1403729 0.8620111 -0.0379503 0.0241479 -0.0428215 0.1349585 -0.3288397 0.2334928 -0.0179578 0.4178407 -0.350926 0.0270839 -0.0270474 0.0238668 0.0472522 0.0220037 0.0938545 -0.0057172 0.0689236 -0.0064765 0.0077527 -0.0046727 0.0081626 0.1404695 0.0450486 -0.0815231 0.0027002 -0.0629592 -0.0230422 0.0076263 0.0016784 0.0074003 0.1518997 0.1007642 -0.0505715 0.0015197 -0.0177777 0.0533789 0.0053949 0.0001722 0.0049191 0.1710946 0.0865659 0.0628118 -0.0040332 0.0250625 0.0759585 0.0049565 -0.0022218 0.0052894 0.1726287 0.0773272 -0.011293 -0.0003043 -0.0305408 -0.0170358 0.0079954 0.0004013 0.0080906 0.148253 0.0702789 -0.0523563 0.0014228 -0.0639817 -0.0857397 0.0117546 0.0011245 0.0120136 0.1577702 0.0684662 -0.004649 0.0725903 -0.0248208 0.067692 0.081498 0.0298669 0.0997358 -0.0306738 -0.1109325 -0.0193775 -0.003282 -0.0907168 0.0718376 0.0010732 0.0000369 0.0025994 0.1249298 0.072335 -0.0077674 -0.0681055 -0.024084 0.0484689 -0.0903259 -0.0238902 -0.1078966 -0.0146999 unknown
polarizability: 277.638836|-6.6547392|129.6620524|3.1800668|-3.7884534|53.7485618 unknown
InChI: InChI=1S/C10H9NO3/c1-8(12)2-3-9-4-6-10(7-5-9)11(13)14/h2-7H,1H3
charge 0 multiplicity 1
23 atoms
O  -4.626317 -1.148659 -0.023709
O  4.380414 1.355088 -0.03324
O  4.619147 -0.912661 0.073452
N  3.897887 0.157449 0.016526
C  -0.382492 -0.285801 -0.011522
C  0.217858 1.008748 -0.065756
C  0.470605 -1.427454 0.053224
C  2.4236 0.002027 0.007517
C  1.612671 1.159695 -0.056557
C  1.869886 -1.295448 0.06304
C  -1.834477 -0.498504 -0.019908
C  -2.818058 0.452296 -0.082276
C  -4.262241 0.063924 -0.083234
C  -5.271112 1.201529 -0.160238
H  -0.412505 1.901964 -0.115314
H  0.021823 -2.426109 0.095736
H  2.08833 2.142953 -0.097524
H  2.533663 -2.162296 0.111975
H  -2.182971 -1.541213 0.028499
H  -2.590867 1.524883 -0.134474
H  -5.112036 1.798907 -1.078497
H  -6.295626 0.800455 -0.159137
H  -5.146081 1.889225 0.698215
