program: Gaussian 09
title: 000101910
version: EM64L-G09RevD.01
frameworkgroup: C1[X(C4H8N2O4)]
method: RPBEPBE
basis: SDD
operation: Freq
keyword: #pfreq=noraman
keyword: PBEPBE/SDD
title: #p freq=noraman PBEPBE/SDD
converged: YES YES NO NO
title: Mulliken charges:
elementType: O O O O N N C C C C H H H H H H H H
charge: -0.421923 -0.439755 -0.236777 -0.231606 -0.581469 -0.641884 -0.169197 -0.173279 0.203609 0.181670 0.265102 0.280183 0.317719 0.284553 0.320118 0.280295 0.374677 0.387964
chargesum: 0.00000
title: Mulliken charges with hydrogens summed into heavy atoms:
elementType: O O O O N N C C C C
charge: -0.047246 -0.051791 -0.236777 -0.231606 0.020804 -0.041471 0.095904 0.106905 0.203609 0.181670
polarizability: 7.57735979e+01 1.46677818e+00 6.86640443e+01 6.57844043e+00 2.75252915e+00 6.59048777e+01
1716.lowfreq: -12.3678 -4.4325 0.0003 0.0007 0.0008 12.7867 45.4850 87.4898 93.9879
frequency: 45.2472 87.4483 93.9787 129.0063 170.2690 220.4043 248.7255 271.0464 312.2345 359.7127 391.4900 437.3321 498.6982 536.7402 560.3147 589.9461 608.6454 621.6116 642.8738 698.0567 721.3789 764.9967 864.8328 997.6049 1046.0393 1061.1689 1095.0838 1115.3800 1158.2454 1186.8611 1236.4217 1258.2249 1278.1636 1336.3833 1357.8969 1374.1215 1617.2269 1626.4008 1652.8054 1676.2176 2944.7054 3062.6295 3471.6313 3494.6518 3502.6578 3526.1642 3613.2449 3636.1795
redmass: 7.2727 5.8089 5.0521 6.1024 1.3556 3.6253 4.1047 5.1916 4.6772 1.3090 3.0969 2.9761 3.7550 2.3607 1.4553 1.6369 1.9787 1.5951 1.6381 3.9964 3.7391 4.9123 3.0469 4.0890 2.5608 2.2179 1.4892 3.2334 1.2557 1.8393 1.7256 1.6581 1.6085 1.6017 1.4423 1.7794 1.1924 1.2480 7.1686 3.5686 1.0817 1.0858 1.0446 1.0468 1.0639 1.0641 1.0998 1.0986
irintensity: 2.0046 1.2644 3.6870 2.7422 13.2032 1.2555 1.5224 2.2394 3.7362 75.8254 30.9722 14.0979 62.7351 80.4673 48.7347 190.0708 30.9828 93.2413 423.2329 41.7591 3.8459 9.8104 13.1640 53.7636 294.3605 209.1551 2.8588 17.8830 6.5672 12.5069 2.0773 7.9017 14.8976 10.2258 21.4312 7.3166 186.8294 76.1074 130.5665 185.5109 19.8603 14.3573 14.8969 14.4948 17.4901 32.8808 19.6926 21.4291
temp: 298.150 k
press: 1.00000 atm
elementType: 8 8 8 8 7 7 6 6 6 6 1 1 1 1 1 1 1 1
symmnumber: 1
zpe: 354101.2 jmol-1
zpe.correction: 0.134870 hartree
zpe.thermalcorrener: 0.146009 hartree
zpe.thermalcorrenthalpy: 0.146953 hartree
zpe.thermalcorrgfe: 0.098090 hartree
zpe.sumelectzpe: -566.831311 hartree
zpe.sumelectthermal: -566.820172 hartree
zpe.sumelectthermalent: -566.819228 hartree
zpe.sumelectthermalfe: -566.868091 hartree
dipole: 1.2430 1.3840 1.1813
dipole: 2.2036
quadrupole: -54.9133 -53.8444 -57.6063
quadrupole: -1.4572 -4.9716 -6.6666
quadrupole: 0.5414 1.6103 -2.1517 -1.4572 -4.9716 -6.6666
hfenergy: -566.9661808 hartree
pointgroup: C01 [X(C4H8N2O4)]
dipole: 0.3513603 -0.6597034 -0.4393096 debye
dipolederiv: -1.3746399 -0.0175466 0.0678981 0.0291744 -0.3932609 0.0375587 -0.0014787 0.0355258 -0.2370135 -0.4930864 -0.1436759 -0.0151251 -0.1343217 -1.1448226 0.2065302 -0.0414184 0.2746079 -0.3588545 -0.8120575 0.0621449 0.0164764 0.0872113 -0.2988312 -0.0713577 0.2107122 -0.230205 -0.8791706 -0.6662683 0.2707155 0.1846655 0.177069 -0.8057352 0.0109246 0.2919471 -0.2064872 -0.5034814 -0.4065951 -0.0196972 -0.2620432 -0.0049279 -0.6520114 -0.1473571 -0.2122678 -0.1954771 -0.7287305 -0.7595133 -0.1193089 -0.0793343 0.0118797 -0.6771564 0.0540747 -0.1008261 0.0826838 -0.2756193 0.161084 0.0211639 0.0384513 -0.0958525 0.4397546 0.034077 0.0334446 0.0024292 0.2242311 0.1841063 -0.0609776 0.1909806 0.0425384 0.5011598 -0.1289379 0.2298932 -0.0687232 -0.0195729 1.6428392 -0.0350977 -0.062061 -0.0735972 0.1737664 0.1537172 -0.1752189 0.2480485 0.9662313 0.8629517 -0.1741582 -0.3415017 -0.1128359 1.4561611 -0.1242477 -0.4188136 -0.0347934 0.7202039 0.0166817 -0.0462329 0.088074 -0.0288064 0.0198467 0.0181565 0.0521595 0.0428639 -0.0359832 0.0134315 -0.0519278 -0.0578609 -0.0752488 -0.0239546 -0.0397694 -0.0686267 -0.0580824 -0.0168747 0.3372348 -0.0096765 0.0559172 -0.0115539 0.1915596 0.0454218 0.0864636 0.076962 0.1852236 0.0574662 0.0694527 0.0615457 0.0488857 0.1474098 0.0469283 -0.0048783 0.093029 0.3624237 0.2834469 0.1374467 0.0389866 0.0423087 0.2125434 0.0077456 0.0499719 -0.0299515 0.2142188 0.3348686 0.0730959 -0.0212901 0.0136636 0.1656721 0.0091715 0.0096138 0.0391085 0.0767311 0.3198987 0.0091493 -0.0146986 -0.0052505 0.3783141 -0.0503454 -0.0756838 -0.0569552 0.0869108 0.298151 0.0351304 0.1109195 0.089664 0.3095846 -0.062291 0.1350064 -0.0145835 0.2191263 unknown
polarizability: 74.4079927|-2.951269|70.0197826|-6.0887284|3.886605|65.9147447 unknown
InChI: InChI=1S/C4H8N2O4/c5-1(3(7)8)2(6)4(9)10/h1-2,7,9H,5-6H2
charge 0 multiplicity 1
18 atoms
O  2.767313 0.009802 0.272163
O  -1.727887 -1.171748 0.533582
O  0.830237 0.32354 1.516599
O  -2.284962 1.061566 0.809517
N  0.550057 -1.746416 -1.069347
N  -0.516784 1.881103 -1.140835
C  0.66952 -0.292183 -0.900545
C  -0.706319 0.439679 -0.995454
C  1.37375 0.079814 0.415656
C  -1.628275 0.18817 0.207656
H  1.28296 0.104918 -1.726173
H  -1.212718 -0.029274 -1.868576
H  -0.069996 -2.197239 -0.389808
H  1.43205 -2.233454 -1.241438
H  -1.027839 2.44628 -0.45764
H  -0.536945 2.242157 -2.093864
H  3.200449 0.185795 1.151769
H  -2.30861 -1.269009 1.335341
