program: Gaussian 09
title: 000009169
version: EM64L-G09RevD.01
frameworkgroup: C1[X(C26H16)]
method: RPBEPBE
basis: SDD
operation: Freq
keyword: #p
keyword: freq=noraman
keyword: PBEPBE/SDD
title: #p freq=noraman PBEPBE/SDD
converged: NO YES NO NO
title: Mulliken charges:
elementType: C C C C C C C C C C C C C C C C C C C C C C C C C C H H H H H H H H H H H H H H H H
charge: 0.253397 0.253398 0.203019 0.203019 0.485885 0.485879 -0.421158 -0.421161 -0.603717 -0.603721 -0.545546 -0.545546 0.412650 0.412650 -0.721339 -0.721336 0.405856 0.405856 -0.433553 -0.433552 -0.427612 -0.427612 -0.245967 -0.245969 -0.242678 -0.242676 0.221869 0.221871 0.227977 0.227981 0.240569 0.240568 0.249222 0.249222 0.241704 0.241704 0.242224 0.242224 0.228623 0.228624 0.228575 0.228574
chargesum: 0.00000
title: Mulliken charges with hydrogens summed into heavy atoms:
elementType: C C C C C C C C C C C C C C C C C C C C C C C C C C
charge: 0.253397 0.253398 0.203019 0.203019 0.485885 0.485879 -0.199288 -0.199290 -0.375740 -0.375740 -0.304977 -0.304978 0.412650 0.412650 -0.472116 -0.472114 0.405856 0.405856 -0.191848 -0.191848 -0.185388 -0.185388 -0.017344 -0.017344 -0.014103 -0.014102
polarizability: 7.06863111e+02 -1.46271640e+01 2.85029355e+02 -2.92618131e-03 -7.19045680e-04 1.02732069e+02
1716.lowfreq: -0.0007 -0.0005 0.0007 6.2280 9.5032 21.9971 27.8840 59.1224 86.3908
frequency: 27.8840 59.1224 86.3768 96.8826 100.7965 136.1974 182.8356 192.0023 237.0019 242.6958 256.8565 282.4698 316.0644 343.1315 383.2374 401.3786 415.1706 422.6609 470.0049 470.4639 476.0432 476.2024 489.1089 532.6741 538.5843 540.3301 555.8647 587.3920 591.4039 620.0401 620.7559 647.3578 679.0062 704.6258 718.0360 737.6838 753.5995 757.6971 777.4877 781.0690 781.8275 784.1480 801.3616 832.1925 841.9557 845.2914 860.6707 866.2863 869.6638 900.6007 901.8119 904.0736 925.8345 933.4211 938.4265 966.3833 967.5896 978.9053 983.3863 990.6255 990.6860 993.1455 1016.1948 1016.4157 1074.0548 1130.4994 1136.7615 1169.2989 1171.4810 1176.0190 1189.6483 1197.0180 1209.1408 1229.8457 1234.7541 1265.1398 1277.4339 1287.4896 1293.8190 1300.2404 1307.6694 1336.2716 1338.5503 1403.8675 1406.3746 1406.7142 1418.5247 1427.6208 1432.0792 1439.6674 1443.7609 1446.3100 1478.3732 1488.2388 1491.4075 1544.8353 1558.9943 1563.7506 1587.4107 1592.6215 1616.7898 1624.7226 1636.9224 1638.8583 3117.0921 3117.1029 3118.6454 3118.6523 3123.5426 3123.6485 3124.9103 3125.6300 3139.3878 3139.7986 3141.7826 3141.7869 3160.7668 3160.8361 3162.9151 3163.5673
redmass: 5.9746 4.0058 5.2586 5.6139 4.1056 4.7465 6.0712 4.2408 4.1245 6.0150 4.5793 3.9740 4.9947 4.0956 3.1749 5.3979 6.9742 3.2451 2.4620 2.4402 5.7097 5.3247 3.4963 3.3445 6.1673 7.1598 3.4873 6.9445 3.2141 6.7096 6.7052 3.4157 6.2834 6.5357 6.4833 2.5199 1.2409 1.3403 4.6824 2.6103 2.1381 5.0871 1.5235 1.4600 1.8013 4.4087 1.5734 1.8011 4.7391 5.6954 1.6772 1.5022 5.1132 2.1552 2.0621 1.4048 1.3968 1.4224 1.4870 1.3545 1.3641 3.6052 2.2758 2.2689 3.3304 1.8042 1.6992 1.1994 1.0841 1.2313 1.4349 1.2827 1.4399 1.5581 1.5723 2.0326 2.5533 1.5817 2.5362 1.9247 2.7913 2.3173 2.3792 4.3606 3.0776 5.2036 2.5406 3.2726 3.3318 3.4315 4.0110 3.6849 2.9572 3.8454 2.9913 5.3414 6.0607 6.9812 5.9413 5.8198 6.4789 6.6109 6.7207 6.7327 1.0907 1.0907 1.0862 1.0862 1.0887 1.0887 1.0882 1.0878 1.0916 1.0912 1.0949 1.0949 1.1003 1.1001 1.0934 1.0929
irintensity: 0.1609 0.1483 0.0000 0.2706 0.0000 3.1189 0.0000 0.5454 0.0000 0.0000 0.0000 1.0690 2.9965 1.9183 0.0000 0.0000 1.9164 1.1128 0.0000 39.6450 0.0000 5.1176 0.0000 0.0000 9.2276 0.0000 0.3167 0.0000 3.2145 10.2188 0.0000 0.0000 6.4131 8.7668 0.0000 36.8402 0.0000 114.5819 0.0000 0.0000 0.9662 3.6289 0.0000 11.4565 0.0000 0.0000 0.1266 0.0000 4.1376 0.0000 0.0001 144.8592 0.6237 10.0400 0.0000 0.0000 20.2365 8.6078 0.0000 0.3823 0.0000 0.0000 12.5836 0.0001 0.2576 0.0000 12.6663 0.0000 1.0175 0.0000 18.1920 0.0000 3.2805 0.0000 22.1703 7.9236 0.0000 0.0000 3.9001 3.6860 0.0000 1.3916 0.0000 12.2693 0.0000 0.0000 5.5709 0.0000 0.0606 0.0000 2.9078 0.0000 3.6061 17.1443 0.0000 0.0000 11.7512 0.0000 2.8659 0.0000 9.7617 0.0000 0.0000 2.1524 11.8264 0.0393 13.3680 0.1310 0.0002 1.6330 18.4623 0.0003 0.0013 1.2035 53.1689 11.5044 117.6706 0.0719 50.2257 0.0037
temp: 298.150 k
press: 1.00000 atm
elementType: 6 6 6 6 6 6 6 6 6 6 6 6 6 6 6 6 6 6 6 6 6 6 6 6 6 6 1 1 1 1 1 1 1 1 1 1 1 1 1 1 1 1
symmnumber: 1
zpe: 865810.1 jmol-1
zpe.correction: 0.329770 hartree
zpe.thermalcorrener: 0.347504 hartree
zpe.thermalcorrenthalpy: 0.348448 hartree
zpe.thermalcorrgfe: 0.284452 hartree
zpe.sumelectzpe: -998.734637 hartree
zpe.sumelectthermal: -998.716903 hartree
zpe.sumelectthermalent: -998.715959 hartree
zpe.sumelectthermalfe: -998.779954 hartree
dipole: 0.0000 0.0000 0.0001
dipole: 0.0001
quadrupole: -123.9523 -126.3034 -161.7465
quadrupole: 0.0283 -0.0003 -0.0002
quadrupole: 13.3818 11.0307 -24.4125 0.0283 -0.0003 -0.0002
hfenergy: -999.0644067 hartree
pointgroup: C01 [X(C26H16)]
dipole: -0.0000007 0.0000016 -0.0000378 debye
polarizability: 706.8064504|15.4224469|285.0860147|-0.0029275|0.0007135|102.7320689 unknown
InChI: InChI=1S/C26H16/c1-3-7-19-15-25-21(13-17(19)5-1)9-11-24-23(25)12-10-22-14-18-6-2-4-8-20(18)16-26(22)24/h1-16H
charge 0 multiplicity 1
42 atoms
C  -0.509263 -0.501029 0.000002
C  0.50928 0.501058 0.000004
C  -1.924376 -0.112637 0.000012
C  1.924399 0.112659 0.0000
C  -2.27072 1.304682 -0.000007
C  2.270736 -1.30466 -0.000038
C  -0.119175 -1.89385 -0.000046
C  0.119188 1.893877 -0.000021
C  -2.982161 -1.051294 0.000039
C  2.982189 1.051313 0.000035
C  1.207421 -2.279687 -0.00007
C  -1.207413 2.279709 -0.000028
C  -4.347077 -0.657968 0.000052
C  4.347101 0.657975 0.000021
C  -3.626119 1.704059 -0.000006
C  3.62613 -1.704046 -0.000039
C  -4.68302 0.759816 0.000022
C  4.683036 -0.75981 -0.000022
C  -5.4169 -1.621639 0.000084
C  5.416931 1.621639 0.00004
C  -6.06933 1.147746 0.000021
C  6.069343 -1.14775 -0.000048
C  -6.748173 -1.212182 0.000088
C  6.748203 1.212175 0.000015
C  -7.077985 0.187415 0.00005
C  7.078003 -0.187424 -0.000016
H  -0.8897 -2.669552 -0.000091
H  0.889702 2.669588 -0.000057
H  -2.769737 -2.125249 0.000071
H  2.769774 2.125266 0.000064
H  1.472815 -3.34346 -0.000123
H  -1.472805 3.343484 -0.000067
H  -3.863671 2.775497 -0.000019
H  3.863678 -2.775485 -0.000077
H  -5.166182 -2.689362 0.000105
H  5.166219 2.689363 0.000079
H  -6.319262 2.215613 -0.000008
H  6.319267 -2.21562 -0.000093
H  -7.55298 -1.955548 0.000113
H  7.553015 1.955533 0.000039
H  -8.130079 0.493339 0.000052
H  8.130096 -0.493354 -0.000031
