program: Gaussian 09
title: 000101991
version: EM64L-G09RevD.01
frameworkgroup: C1[X(C16H25NO4)]
method: RPBEPBE
basis: SDD
operation: Freq
keyword: #p
keyword: freq=noraman
keyword: PBEPBE/SDD
title: #p freq=noraman PBEPBE/SDD
converged: YES YES NO NO
title: Mulliken charges:
elementType: O O O O N C C C C C C C C C C C C C C C C H H H H H H H H H H H H H H H H H H H H H H H H H
charge: -0.289791 -0.289815 -0.281146 -0.281174 -0.448080 -0.172903 -0.411351 0.121888 0.121774 0.213688 0.213677 -0.353030 0.083218 0.083229 -0.762387 -0.762403 -0.698468 -0.213782 -0.213726 -0.676505 -0.676527 0.267106 0.216074 0.216000 0.201542 0.201532 0.287710 0.268212 0.271287 0.186575 0.271100 0.268411 0.186575 0.208937 0.208941 0.212427 0.223630 0.222682 0.222835 0.223464 0.207911 0.227619 0.228764 0.207914 0.228771 0.227593
chargesum: 0.00000
title: Mulliken charges with hydrogens summed into heavy atoms:
elementType: O O O O N C C C C C C C C C C C C C C C C
charge: -0.289791 -0.289815 -0.281146 -0.281174 -0.160370 0.094203 0.020723 0.121888 0.121774 0.213688 0.213677 0.050044 0.083218 0.083229 -0.036312 -0.036316 -0.068163 0.232530 0.232573 -0.012211 -0.012249
polarizability: 2.38397161e+02 1.05447883e-02 2.35871566e+02 -3.66809723e-02 9.50192075e+00 1.44992169e+02
1716.lowfreq: -4.4176 -0.0003 0.0003 0.0006 2.2733 6.3399 28.5458 33.6158 41.0243
frequency: 28.5163 33.6030 41.0006 51.2697 65.0534 67.4383 70.9090 72.7461 81.8273 88.5881 106.4236 117.7260 118.4157 125.9181 136.8169 198.8696 202.3199 219.9333 230.3847 233.3717 256.0095 256.6207 263.2415 286.7309 287.6662 334.8168 343.8834 358.7754 359.6993 378.2077 407.8756 433.1951 549.5224 553.6759 567.0323 567.1582 592.5980 631.2673 653.2733 691.3590 724.9199 747.9747 767.1175 772.6779 790.5194 798.5342 798.6354 841.3193 842.1837 860.3665 880.6679 957.7653 985.3310 990.1125 1012.9184 1017.0998 1032.5760 1033.2852 1037.0014 1047.3339 1057.2587 1075.8522 1100.1615 1110.2757 1111.0315 1134.6510 1135.6651 1135.8070 1156.6085 1201.3496 1233.9370 1241.4942 1246.0725 1246.2457 1263.3625 1285.9129 1299.2334 1309.1096 1319.3424 1343.3598 1358.5438 1360.7961 1362.0895 1386.5540 1398.4345 1399.2943 1406.4434 1411.0886 1439.0367 1441.0349 1462.5164 1462.5392 1463.0978 1463.5253 1464.8777 1473.2933 1473.6909 1474.1276 1474.5648 1476.0018 1485.9017 1487.2438 1488.2463 1567.0011 1582.2499 1630.6991 1647.2505 2967.2213 2969.8050 2981.6100 2985.9012 2986.5227 2992.8767 2993.0255 3003.4089 3003.5448 3013.2148 3042.4122 3049.6905 3060.0520 3060.0969 3066.6796 3067.2580 3079.7264 3080.1473 3089.2959 3089.6482 3100.8391 3101.4047 3103.7693 3103.9455 3550.8404
redmass: 3.1876 3.2976 3.2984 3.2002 3.6992 2.4655 2.8201 1.6620 2.3908 2.9004 3.5789 1.3128 1.2327 2.5192 2.8429 3.4416 1.5205 3.8758 1.4890 2.7782 1.5317 1.4049 2.6316 5.1706 3.1620 5.1442 4.7346 5.1942 3.9988 4.2703 3.7148 4.7430 3.8654 3.6766 2.0081 4.3396 2.1591 3.8324 3.8387 6.6678 3.3015 1.5782 6.7117 5.9266 3.0611 1.1136 1.1118 3.1578 3.7236 2.2362 1.4344 1.8289 4.2411 2.1749 1.6569 2.4634 1.5117 2.9742 1.5595 4.8525 2.7990 1.8542 2.3311 2.2204 2.2196 2.5498 1.4689 1.4673 5.5269 2.0227 1.2665 1.8702 1.1367 1.1374 2.3283 1.1309 4.9292 1.9090 1.3467 1.7107 1.4861 1.4717 1.7506 1.2147 1.2719 1.2722 1.2129 1.1736 1.0504 1.0472 1.1079 1.1199 1.0408 1.0507 1.1052 1.0603 1.0889 1.0576 1.0576 2.0871 1.0821 1.0766 1.0685 8.0997 9.9196 4.1111 9.1347 1.0465 1.0479 1.0590 1.0400 1.0400 1.0359 1.0359 1.0578 1.0578 1.0994 1.1028 1.0840 1.1064 1.1064 1.0992 1.1012 1.0976 1.0976 1.0986 1.0985 1.0963 1.0963 1.1021 1.1021 1.0772
irintensity: 0.0329 0.4627 2.0139 0.0002 0.3106 0.0344 1.4508 0.0004 0.0805 5.6718 1.4107 0.0487 3.4897 0.0473 4.1036 4.2132 0.0934 5.5667 0.0419 1.4076 0.0032 2.2733 0.0010 1.4766 0.0877 2.4232 2.8177 9.5856 16.9009 0.2049 1.4577 2.7537 2.6925 0.4173 25.6776 3.0949 35.5006 6.6429 1.1860 18.8068 0.3813 2.7015 10.9332 7.6625 3.6215 1.1272 4.1112 0.9812 0.7941 5.9856 0.1299 21.3766 79.5667 38.9943 16.4770 34.2190 14.5002 147.7364 12.6340 441.1410 110.4148 64.8783 22.2920 0.0012 0.2979 52.9890 1.4937 9.1579 10.7515 175.0949 29.2138 141.3877 0.2644 0.4601 207.0118 0.8942 48.9689 11.3377 4.0402 14.6241 3.1695 2.3091 6.9369 10.0662 0.4999 36.9487 113.9311 9.4416 14.4557 24.0221 28.2613 24.8748 1.0917 21.0534 15.7058 18.0259 6.4250 7.3315 6.2975 362.0611 7.6373 40.0947 1.4564 578.2539 16.3182 0.3940 227.0446 33.9418 17.6457 42.4312 0.1093 66.5786 1.3339 43.1129 50.8167 7.3003 1.3250 11.4163 3.7013 0.3099 21.1860 45.5424 74.5036 8.5183 27.4045 65.8892 9.0343 4.6585 6.8580 5.6237 83.8894 40.4458
temp: 298.150 k
press: 1.00000 atm
elementType: 8 8 8 8 7 6 6 6 6 6 6 6 6 6 6 6 6 6 6 6 6 1 1 1 1 1 1 1 1 1 1 1 1 1 1 1 1 1 1 1 1 1 1 1 1 1
symmnumber: 1
zpe: 1011394.1 jmol-1
zpe.correction: 0.385220 hartree
zpe.thermalcorrener: 0.409997 hartree
zpe.thermalcorrenthalpy: 0.410941 hartree
zpe.thermalcorrgfe: 0.329157 hartree
zpe.sumelectzpe: -978.731014 hartree
zpe.sumelectthermal: -978.706237 hartree
zpe.sumelectthermalent: -978.705293 hartree
zpe.sumelectthermalfe: -978.787077 hartree
dipole: -0.0005 -0.8965 -0.0006
dipole: 0.8965
quadrupole: -137.6684 -100.3944 -127.5743
quadrupole: 0.0028 0.0157 1.4038
quadrupole: -15.7894 21.4846 -5.6953 0.0028 0.0157 1.4038
hfenergy: -979.1162337 hartree
pointgroup: C01 [X(C16H25N1O4)]
dipole: -0.0010061 0.2888313 0.2024473 debye
polarizability: 238.3944104|0.3324642|197.0622394|-0.390131|45.9453991|183.8042455 unknown
InChI: InChI=1S/C16H25NO4/c1-6-9-12-13(15(18)20-7-2)10(4)17-11(5)14(12)16(19)21-8-3/h12,17H,6-9H2,1-5H3
charge 0 multiplicity 1
46 atoms
O  -2.347545 -1.4447 -0.272646
O  2.355911 -1.421031 -0.286304
O  -3.677787 -0.14132 1.130853
O  3.681116 -0.105194 1.110426
N  -0.005005 1.86854 2.231796
C  -0.001151 -0.084235 0.160136
C  -0.00856 0.538954 -1.279434
C  -1.266285 0.293987 0.941454
C  1.264534 0.306699 0.934143
C  -1.243081 1.31113 1.880847
C  1.236573 1.323772 1.873632
C  -0.017924 2.082011 -1.341383
C  -2.533049 -0.393391 0.650606
C  2.53629 -0.368092 0.636135
C  -2.428341 1.878188 2.631441
C  2.42038 1.903351 2.61686
C  -0.02283 2.60446 -2.795221
C  -3.568904 -2.226645 -0.609236
C  3.583054 -2.190955 -0.629602
C  -3.131532 -3.331211 -1.567481
C  3.153264 -3.293169 -1.593908
H  0.003981 -1.176856 0.012452
H  -0.896504 0.143562 -1.811364
H  0.881424 0.154261 -1.815804
H  0.869745 2.480813 -0.810678
H  -0.908984 2.470422 -0.808625
H  -0.006936 2.630537 2.910881
H  -2.891486 1.11083 3.275302
H  -3.222664 2.19739 1.938243
H  -2.125569 2.736512 3.260492
H  3.206185 2.2327 1.918614
H  2.897052 1.140461 3.256076
H  2.112177 2.757281 3.249221
H  0.871114 2.253581 -3.34523
H  -0.914113 2.243257 -3.342862
H  -0.029295 3.709892 -2.830489
H  -4.003441 -2.625292 0.325852
H  -4.310624 -1.54334 -1.062448
H  4.318745 -1.498952 -1.079361
H  4.021967 -2.591969 0.302471
H  -4.003947 -3.946019 -1.855846
H  -2.687608 -2.905296 -2.483782
H  -2.383069 -3.98893 -1.093091
H  4.030134 -3.899539 -1.886601
H  2.410335 -3.959485 -1.122797
H  2.705254 -2.865372 -2.507343
