program: Gaussian 09
title: 000101892
version: EM64L-G09RevD.01
frameworkgroup: C1[X(C13H10)]
method: RPBEPBE
basis: SDD
operation: Freq
keyword: #p
keyword: freq=noraman
keyword: PBEPBE/SDD
title: #p freq=noraman PBEPBE/SDD
converged: NO YES NO NO
title: Mulliken charges:
elementType: C C C C C C C C C C C C C H H H H H H H H H H
charge: -0.309569 0.296046 0.135945 0.359332 -0.487256 -0.230880 -0.407741 -0.376655 -0.417387 -0.218978 -0.229409 -0.237114 -0.228714 0.263718 0.254261 0.230153 0.235975 0.235153 0.242521 0.223929 0.219741 0.223921 0.223008
chargesum: 0.00000
title: Mulliken charges with hydrogens summed into heavy atoms:
elementType: C C C C C C C C C C C C C
charge: -0.045851 0.296046 0.135945 0.359332 -0.232995 -0.000727 -0.171766 -0.141502 -0.174866 0.004951 -0.009668 -0.013192 -0.005707
polarizability: 2.59635811e+02 -5.74591163e+00 1.48516970e+02 -4.29951190e-01 1.10697495e+00 5.94209301e+01
1716.lowfreq: -13.4803 -4.2005 -0.0007 -0.0003 -0.0001 4.9215 97.9343 130.0359 198.4249
frequency: 97.9292 130.0307 198.4244 248.1087 255.8219 392.0700 411.2225 452.7771 479.8391 504.7578 522.8291 543.6536 596.6225 611.6368 666.6518 694.4672 698.4283 739.3291 756.9187 781.4615 792.8229 819.1666 853.4147 855.8344 926.9659 936.9086 957.6691 966.0076 977.6872 983.0484 983.6059 993.0925 1039.5848 1100.3648 1114.8629 1127.4395 1154.9609 1166.3009 1189.2554 1210.8019 1261.8397 1319.2009 1344.3683 1369.2458 1387.4661 1408.0325 1456.4369 1467.5156 1515.2923 1528.9280 1538.3578 1605.6195 1627.0386 2755.0801 3119.5885 3121.8852 3125.4513 3130.1788 3145.3720 3146.0619 3160.8155 3161.8601 3185.8696
redmass: 4.5315 3.4661 4.0517 4.1982 3.8229 3.2890 3.8060 2.9611 3.2560 5.1169 3.0531 3.4202 6.7579 5.8384 1.6273 1.7769 2.3413 1.9366 2.3858 1.8127 3.0680 1.5653 2.2057 2.6360 1.7882 1.3064 1.3608 1.3086 2.7734 2.5414 1.3301 2.2578 1.3012 2.0757 1.8899 1.6609 1.1821 1.1020 1.4877 1.5538 2.0855 2.0399 1.6696 2.7253 2.0377 2.6292 5.4707 3.6418 6.2760 5.1510 5.9776 6.1314 6.9949 1.0720 1.0846 1.0845 1.0877 1.0880 1.0959 1.0962 1.1002 1.0999 1.0952
irintensity: 2.3542 0.0646 0.5297 2.0604 0.6662 10.8311 6.8233 8.2361 11.6303 6.9864 11.3120 0.8676 1.4891 0.7894 16.6104 57.7771 39.5953 4.9975 7.8023 82.0586 24.5968 3.6250 6.1737 1.3043 21.1550 1.1343 0.6614 4.1744 29.1877 9.6247 0.6274 4.4068 7.0841 1.7977 5.4747 4.0768 2.1682 1.6690 6.2962 11.9703 0.4664 8.3208 9.1585 1.0638 7.8547 7.2878 1.7248 1.4710 1.8298 6.9106 1.4830 9.8110 7.4222 0.6837 5.5611 0.0450 5.0837 0.7187 8.8515 60.7252 74.3555 7.8300 3.6352
temp: 298.150 k
press: 1.00000 atm
elementType: 6 6 6 6 6 6 6 6 6 6 6 6 6 1 1 1 1 1 1 1 1 1 1
symmnumber: 1
zpe: 477395.4 jmol-1
zpe.correction: 0.181830 hartree
zpe.thermalcorrener: 0.191175 hartree
zpe.thermalcorrenthalpy: 0.192119 hartree
zpe.thermalcorrgfe: 0.147432 hartree
zpe.sumelectzpe: -500.446685 hartree
zpe.sumelectthermal: -500.437340 hartree
zpe.sumelectthermalent: -500.436396 hartree
zpe.sumelectthermalfe: -500.481083 hartree
dipole: -0.4395 -0.3816 0.5424
dipole: 0.7956
quadrupole: -66.3994 -65.4836 -81.5289
quadrupole: 0.9338 -0.3366 -0.7696
quadrupole: 4.7379 5.6537 -10.3916 0.9338 -0.3366 -0.7696
hfenergy: -500.628515 hartree
pointgroup: C01 [X(C13H10)]
dipole: -0.1740936 0.1552077 -0.2087595 debye
dipolederiv: -0.1548184 0.1268036 -0.0433994 0.2423005 -0.1047292 -0.0213269 -0.4786962 0.1118057 0.0692439 0.067719 0.0107845 0.0798355 -0.1977229 -0.1360562 -0.0529643 0.1877317 -0.0106177 -0.0047988 -0.1264219 -0.1160218 -0.0421927 0.1053138 -0.0365539 0.0061862 0.0991462 0.0132164 -0.0135816 0.244311 -0.0195435 -0.0365425 -0.2382503 -0.1105211 0.0261878 0.0130788 -0.0642317 0.0292287 -0.1708679 -0.0363384 0.1313511 -0.1628741 -0.0053377 0.0069257 0.0082462 -0.0897249 -0.2374132 -0.0288972 -0.0528057 -0.1033944 0.0080143 0.0735238 0.0100566 0.1643337 0.0075608 -0.1327124 0.1660339 0.0278876 -0.0402227 0.2026149 0.1285032 -0.0118764 0.0103723 -0.0186088 -0.1618395 0.1190192 0.0173409 0.0232568 -0.1630012 0.0779662 0.0019899 -0.0200754 0.0041276 -0.1465447 0.0211668 0.0283981 0.0306199 0.1037358 0.0796954 0.0069092 0.0144204 0.0497183 -0.171513 0.2192709 -0.0628304 -0.0645561 -0.1328625 -0.0250078 0.0540524 -0.0924517 0.0073683 -0.1420657 -0.3259314 0.0370504 -0.0023619 -0.0660009 0.0671252 0.0099788 -0.0382937 0.0118816 -0.1859686 -0.2433061 -0.1200792 -0.0062989 -0.0007494 0.1195281 -0.0055899 -0.006185 0.0001727 -0.1741955 0.1323818 0.1359303 0.0182396 0.1613394 0.0115182 0.0280304 0.0199948 0.0119976 -0.1581851 0.1706471 0.0316079 -0.0113553 0.1224424 0.1737413 0.0185754 -0.0259296 0.0104197 0.0113171 0.0763361 -0.0134593 -0.021036 0.0120031 -0.0572878 0.0025929 -0.0124701 0.0157027 0.1842478 0.0466551 0.0317228 0.0331011 0.0803397 -0.0810617 -0.0303484 0.1006098 -0.0253921 0.1453775 0.0760854 0.0851718 0.0083482 0.0015751 -0.0939776 -0.0066375 0.0227378 -0.0003537 0.1502264 0.0601103 -0.0875483 -0.0092266 0.010504 -0.0846568 -0.0093425 -0.0076381 -0.0115931 0.1522457 0.0402312 -0.0282905 -0.0046749 -0.1066073 -0.0856083 -0.0115888 -0.0042988 -0.0091036 0.1599242 -0.1594247 0.0468304 0.0652997 0.0456265 0.0840003 -0.0164984 0.0521859 -0.0047409 0.1458817 -0.0281548 -0.1085146 0.0216509 -0.1099175 -0.0336275 -0.0008709 0.0216053 -0.0000699 0.1629216 -0.0334117 0.1126455 -0.0071533 0.1196266 -0.0427699 0.000624 -0.0065164 0.0012614 0.1613539 -0.1687337 -0.0467419 -0.0192881 -0.0374499 0.0815939 -0.005065 -0.0219079 -0.0107965 0.1568496 unknown
polarizability: 259.7229639|4.6056498|148.3536038|-2.1140058|2.414651|59.4971427 unknown
InChI: InChI=1S/C13H10/c1-3-7-12-10(5-1)9-11-6-2-4-8-13(11)12/h1-10H
charge 0 multiplicity 1
23 atoms
C  -1.169701 0.97883 -0.211229
C  -0.716241 -0.469267 -0.120875
C  0.696574 -0.47115 -0.041666
C  1.168033 0.928243 0.033355
C  0.074865 1.802524 0.014248
C  -2.570649 1.237368 0.268478
C  -1.686622 -1.512714 -0.063082
C  1.647417 -1.545453 -0.020413
C  2.586344 1.19193 0.117883
C  -3.454602 0.180448 0.349364
C  -3.032798 -1.194242 0.136534
C  3.005548 -1.248748 0.076568
C  3.472014 0.12122 0.146845
H  -1.260659 1.161707 -1.329051
H  0.106364 2.894212 0.011603
H  -2.891502 2.268499 0.455835
H  -1.36945 -2.561786 -0.097196
H  1.30922 -2.586374 -0.075746
H  2.951026 2.223822 0.168462
H  -4.501507 0.370379 0.614259
H  -3.781349 -1.99147 0.200968
H  3.743324 -2.058618 0.098997
H  4.550151 0.304741 0.220957
