program: Gaussian 09
title: 000101889
version: EM64L-G09RevD.01
frameworkgroup: C1[X(C10H19N)]
method: RPBEPBE
basis: SDD
operation: Freq
keyword: #pfreq=noraman
keyword: PBEPBE/SDD
title: #p freq=noraman PBEPBE/SDD
converged: YES YES NO NO
title: Mulliken charges:
elementType: N C C C C C C C C C C H H H H H H H H H H H H H H H H H H H
charge: -0.102537 0.005881 -0.025887 -0.474255 -0.488419 -0.482411 -0.395701 -0.396931 -0.386380 -0.380342 -0.644306 0.216343 0.165400 0.195903 0.193560 0.191493 0.210879 0.204137 0.210550 0.195271 0.193613 0.190259 0.197152 0.207756 0.187337 0.206062 0.167682 0.237338 0.184596 0.215956
chargesum: 0.00000
title: Mulliken charges with hydrogens summed into heavy atoms:
elementType: N C C C C C C C C C C
charge: -0.102537 0.222225 0.139513 -0.084792 -0.086047 -0.067724 -0.006816 -0.009520 0.008713 -0.006597 -0.006416
polarizability: 1.23641475e+02 3.34678955e-01 1.13759278e+02 -2.24299292e-01 -6.58726701e-03 8.96429297e+01
1716.lowfreq: -17.5979 -0.0007 0.0004 0.0005 17.6078 38.8789 87.5118 125.2169 161.8683
frequency: 87.4020 125.1714 161.8647 215.0340 247.5858 288.3437 305.2614 333.2850 379.3831 390.0612 395.3547 431.9451 438.5923 493.0667 523.0233 544.5301 757.0639 802.0987 827.1104 835.2011 855.5500 892.7573 896.5271 910.4319 959.0176 982.9047 1004.5216 1019.9225 1052.0191 1068.3661 1075.3816 1098.5999 1104.2373 1116.5916 1122.5066 1142.4432 1161.0815 1174.1250 1180.3181 1229.0138 1237.7664 1245.3767 1255.4711 1272.9203 1282.1938 1303.6850 1311.5667 1326.8571 1332.0619 1338.0698 1345.8841 1347.4713 1349.6986 1361.0932 1369.2901 1432.1362 1453.5574 1457.5700 1461.6799 1464.2136 1464.7250 1470.8916 1473.3678 1478.5860 1484.0926 2763.9940 2808.1204 2848.3583 2947.1320 2949.7298 2960.1229 2962.4880 2964.4107 2974.6266 2981.3106 3011.5744 3015.8065 3021.6375 3023.8959 3029.2438 3033.0438 3044.2306 3046.0958 3088.1153
redmass: 2.6356 2.3181 2.2715 1.3680 2.0740 1.8481 1.9298 1.6919 2.2169 3.1874 3.6240 3.1799 3.0263 2.7596 1.8843 1.7637 2.1663 2.3057 1.8696 1.6907 2.0581 1.6970 1.4191 2.5450 2.4239 1.7173 2.1639 1.4772 1.4969 1.5035 1.8069 1.5757 2.2104 1.9415 1.8040 1.9504 1.7939 1.7854 1.8624 1.7534 1.3715 1.4535 1.2947 1.3168 1.2962 1.2822 1.2421 1.4459 1.4084 1.4873 1.5472 1.4614 1.6875 1.4541 1.4391 1.1721 1.0897 1.0895 1.0854 1.0796 1.0937 1.0849 1.0978 1.0653 1.0487 1.0784 1.0703 1.0581 1.0740 1.0620 1.0687 1.0615 1.0648 1.0621 1.0622 1.0971 1.0902 1.0953 1.0958 1.0759 1.0984 1.1019 1.1029 1.0987
irintensity: 0.3807 0.2183 1.2325 0.3385 2.3217 0.5413 0.1644 1.4270 2.1886 0.0360 0.4273 2.1643 0.2437 1.4199 1.7205 0.3133 5.5444 6.4355 3.2007 5.6961 3.6060 1.0140 10.7177 0.0364 2.5248 12.6317 8.3734 4.7175 2.9785 3.8502 14.0075 9.4979 6.9644 0.7033 6.7697 5.7256 2.4011 9.5472 8.9555 4.2993 5.3206 1.4901 1.2179 7.0395 3.3236 3.2238 2.4377 0.7217 5.7872 0.9149 0.8773 0.2160 0.4158 6.8466 6.9159 3.0468 10.6911 3.9319 12.0578 12.4471 8.6523 11.9572 5.6750 4.8300 20.9142 56.4654 96.9824 161.2156 12.6737 1.1158 79.8094 36.4919 35.5370 31.3688 31.4771 0.5442 86.1763 85.9856 68.6397 23.4390 86.9243 32.2894 111.9089 34.8634
temp: 298.150 k
press: 1.00000 atm
elementType: 7 6 6 6 6 6 6 6 6 6 6 1 1 1 1 1 1 1 1 1 1 1 1 1 1 1 1 1 1 1
symmnumber: 1
zpe: 720282.7 jmol-1
zpe.correction: 0.274341 hartree
zpe.thermalcorrener: 0.284827 hartree
zpe.thermalcorrenthalpy: 0.285771 hartree
zpe.thermalcorrgfe: 0.239278 hartree
zpe.sumelectzpe: -446.307152 hartree
zpe.sumelectthermal: -446.296666 hartree
zpe.sumelectthermalent: -446.295721 hartree
zpe.sumelectthermalfe: -446.342214 hartree
dipole: 0.0668 0.0263 0.6925
dipole: 0.6962
quadrupole: -68.5603 -68.4572 -70.9454
quadrupole: -0.0205 -1.1711 0.7742
quadrupole: 0.7607 0.8638 -1.6245 -0.0205 -1.1711 0.7742
hfenergy: -446.5814927 hartree
pointgroup: C01 [X(C10H19N1)]
dipole: -0.0280019 0.00822 -0.2723539 debye
polarizability: 123.6452271|-0.1987456|113.7509049|-0.4178713|-0.1501566|89.6475503 unknown
InChI: InChI=1S/C10H19N/c1-11-8-4-6-9-5-2-3-7-10(9)11/h9-10H,2-8H2,1H3
charge 0 multiplicity 1
30 atoms
N  1.37521 0.879038 0.244477
C  -0.333801 -0.947291 0.248079
C  0.014001 0.489002 -0.239837
C  -1.74251 -1.36757 -0.234652
C  0.742979 -1.961222 -0.197489
C  -1.072959 1.485095 0.233538
C  -2.83089 -0.375634 0.230189
C  -2.485947 1.058885 -0.229407
C  2.140688 -1.505223 0.263235
C  2.417223 -0.072619 -0.226992
C  1.754145 2.266199 -0.106344
H  -0.336474 -0.908972 1.359366
H  0.003034 0.474302 -1.368816
H  -1.96453 -2.388389 0.136352
H  -1.745542 -1.424598 -1.344278
H  0.727111 -2.045963 -1.305413
H  0.505213 -2.965918 0.204848
H  -0.866045 2.501075 -0.150427
H  -1.035754 1.537409 1.341021
H  -2.899891 -0.400156 1.337559
H  -3.821857 -0.677486 -0.162045
H  -2.536808 1.106786 -1.337536
H  -3.234631 1.778914 0.155138
H  2.195016 -1.522369 1.369068
H  2.925521 -2.183887 -0.124417
H  3.395528 0.277281 0.15436
H  2.480983 -0.07696 -1.350042
H  1.10735 2.994788 0.409033
H  1.706331 2.472549 -1.207179
H  2.791704 2.447335 0.227712
