program: Gaussian 09
title: 000102077
version: EM64L-G09RevD.01
frameworkgroup: C1[X(C22H24ClN5O7)]
method: RPBEPBE
basis: SDD
operation: Freq
keyword: #p
keyword: freq=noraman
keyword: PBEPBE/SDD
title: #p freq=noraman PBEPBE/SDD
converged: YES YES NO NO
title: Mulliken charges:
elementType: Cl O O O O O O O N N N N N C C C C C C C C C C C C C C C C C C C C C C H H H H H H H H H H H H H H H H H H H H H H H H
charge: -0.010456 -0.271546 -0.258775 -0.232082 -0.238087 -0.265111 -0.216223 -0.213847 -0.139534 -0.431710 -0.133980 -0.106558 0.017589 -0.443027 -0.446582 0.511307 -0.477587 -0.500276 -0.496046 -0.360999 0.320329 -0.051706 -0.284568 0.252855 0.250936 0.213487 -0.776418 -0.494181 -0.503067 0.303479 -0.263760 -0.251819 0.408405 -0.373481 -0.367380 0.239241 0.271686 0.256252 0.257279 0.279436 0.249102 0.280043 0.259479 0.321922 0.240613 0.285971 0.339247 0.260093 0.223239 0.258511 0.234592 0.248505 0.242425 0.245667 0.244609 0.239230 0.256478 0.310514 0.286287
chargesum: 0.00000
title: Mulliken charges with hydrogens summed into heavy atoms:
elementType: Cl O O O O O O O N N N N N C C C C C C C C C C C C C C C C C C C C C C
charge: -0.010456 -0.271546 -0.258775 -0.232082 -0.238087 -0.265111 -0.216223 -0.213847 -0.139534 -0.092463 -0.133980 -0.106558 0.017589 0.067900 0.066949 0.511307 0.050951 0.039247 -0.174124 -0.120387 0.320329 -0.051706 0.001403 0.252855 0.250936 0.213487 -0.034574 0.231340 0.226439 0.303479 -0.263760 0.004659 0.408405 -0.062968 -0.081093
polarizability: 8.77112972e+02 -4.92801461e+00 3.72188058e+02 -9.14691927e-01 8.32751027e+00 1.80152168e+02
1716.lowfreq: -4.2608 -3.8454 -0.0008 0.0001 0.0012 2.3588 3.2940 6.6489 8.8973
frequency: -1.4042 6.4831 8.7357 13.9616 15.8885 19.8871 24.4364 33.6313 41.2229 59.5257 61.2656 73.1309 76.6034 80.0975 85.1116 90.3968 95.2137 100.0707 109.8477 120.6884 129.5413 142.6066 152.9791 165.2676 169.2456 175.5521 181.0640 192.4576 210.8405 225.7885 261.1072 269.2791 276.8149 282.8252 300.5282 315.3339 327.5723 343.1503 362.9002 369.1058 389.0720 411.5941 422.8318 450.4869 460.9495 469.3669 487.5279 508.7045 519.2859 536.1964 539.3764 554.3854 562.5169 575.0154 585.2830 598.2589 632.1935 643.7567 647.4592 659.9454 685.9603 687.7702 695.1789 728.0671 738.2490 754.1041 773.8011 783.9000 787.3069 794.0156 814.9770 836.7406 839.3521 842.9685 852.7906 891.3012 903.3888 907.3455 920.9631 934.9013 947.1428 968.8319 978.3832 982.6892 988.0605 1004.6833 1022.7737 1023.0436 1042.5138 1043.1963 1053.7690 1077.5300 1100.3654 1112.2649 1114.0932 1114.6572 1125.6739 1135.3158 1148.9402 1149.8022 1157.4626 1178.1187 1189.7066 1194.7169 1198.3644 1212.2457 1229.7854 1233.4853 1240.9641 1274.8091 1280.8989 1286.7822 1289.8978 1301.1482 1304.8406 1330.3423 1349.3460 1359.9752 1368.0215 1379.0358 1387.5444 1390.2650 1393.4265 1418.7531 1423.3568 1423.9893 1445.5788 1445.9567 1446.8315 1450.6608 1452.7962 1453.9679 1462.8916 1463.5704 1463.8064 1472.5449 1481.1306 1499.5786 1504.1703 1523.1988 1549.7717 1561.5803 1588.8355 1610.1258 1628.2554 1638.9246 1647.9139 2998.7246 3005.2394 3006.2177 3008.9061 3009.0589 3028.3436 3033.1868 3055.3285 3063.6809 3088.6802 3096.2917 3096.7702 3105.4715 3112.4303 3113.2866 3153.8742 3155.9600 3157.1919 3163.7386 3176.8816 3187.1089 3190.7694 3198.6784 3406.3491
redmass: 7.4920 5.9640 11.4720 6.9588 5.7992 7.8313 5.8074 6.2756 6.9554 8.4295 1.1954 3.4699 4.5189 2.4411 4.4993 1.2494 3.9040 1.0724 4.8783 4.3972 5.4961 8.1784 5.6564 4.6058 4.0041 8.4094 3.2522 3.3407 5.8225 6.1817 4.8612 4.9572 4.4915 4.0403 8.8244 4.8273 5.7301 10.4528 5.3538 4.7147 5.4168 5.1723 5.0323 3.9362 3.7440 4.9941 3.7012 5.4326 4.8684 4.5100 4.3951 2.9298 4.3539 3.3307 3.2283 5.5488 7.4490 5.3854 4.0192 5.3935 5.0935 5.4388 7.1948 5.0248 4.2799 3.7821 1.8433 1.6147 6.1757 2.1967 1.6095 1.3820 3.0556 2.1741 3.3953 6.1024 1.5516 3.4220 1.4176 5.6488 5.8019 4.3770 2.8065 1.3394 1.3472 1.7554 2.3690 2.5397 1.6446 3.7289 3.9128 1.9762 3.2710 2.1877 1.2720 1.2754 1.5521 1.8820 1.4811 1.4403 2.2830 1.6590 2.9329 3.9685 4.1642 1.8359 2.0862 1.8175 1.6341 1.4817 1.2928 1.6329 1.6791 1.6147 1.5738 5.2805 6.4845 1.4573 1.5321 5.1035 3.7548 1.6305 1.5805 6.4218 1.1767 1.1969 1.1673 2.1200 1.1492 1.0553 1.0501 1.0498 1.2840 1.0607 1.2192 1.6498 1.1786 3.5973 1.3377 2.5223 4.0900 8.5637 7.1750 5.1851 6.5668 8.8930 10.0531 1.0360 1.0621 1.0584 1.0322 1.0295 1.0614 1.0612 1.0994 1.0980 1.1040 1.1038 1.0983 1.1007 1.1049 1.1048 1.1052 1.1050 1.0871 1.0879 1.0964 1.0957 1.0932 1.0917 1.0765
irintensity: 0.6794 2.0938 0.2269 0.1916 0.1945 0.8759 0.4677 0.4265 0.9506 0.1022 2.0472 0.3325 4.6952 0.9787 1.7030 1.3978 3.1382 0.0896 1.1968 0.9006 0.0887 1.2082 5.7493 0.5122 1.2136 3.0307 11.2985 6.6366 6.9592 1.8791 1.8986 5.9946 22.3139 11.4363 8.1692 8.8204 2.4224 0.4636 1.0330 6.4040 0.7544 2.2162 8.8112 10.3517 7.8478 7.9898 10.6050 13.0077 12.6621 4.4024 10.4361 4.4096 5.3915 2.6095 0.6883 15.4039 1.8981 24.2852 4.5356 4.0987 1.7866 20.1416 17.9167 8.5939 3.9155 6.0573 9.7748 23.9545 4.5493 52.8312 27.2143 16.6394 53.2837 35.7617 68.1821 8.5728 40.9258 76.9439 29.1347 9.3390 19.5919 69.0418 30.1064 5.5003 0.7265 23.1850 5.6094 59.2092 14.0656 10.5227 19.0930 4.2363 25.5042 182.1021 5.7693 2.3748 118.2750 305.4808 23.4736 15.7175 104.4929 54.6611 871.0192 1416.5267 244.7651 2.7489 70.5385 76.8542 119.8742 182.6574 9.6868 9.6817 15.4983 106.5076 146.2662 1008.0165 65.0986 40.2613 142.0462 8.8433 199.8633 53.6962 4.4921 40.9093 25.7538 26.9845 13.8443 19.9850 10.9002 25.6642 14.4192 14.8081 155.6541 18.0597 142.5115 165.7260 16.3318 85.5960 27.6727 123.3338 389.8594 23.6164 294.2876 77.6736 917.8981 137.9977 228.1709 5.3766 7.9196 15.2219 28.1881 35.7626 20.3771 53.2000 1.5737 1.6681 10.5838 11.6878 7.5679 12.7732 22.3212 21.8500 12.4095 13.7500 4.4674 2.6619 18.2840 0.1970 7.8877 9.5696 68.3969
temp: 298.150 k
press: 1.00000 atm
elementType: 17 8 8 8 8 8 8 8 7 7 7 7 7 6 6 6 6 6 6 6 6 6 6 6 6 6 6 6 6 6 6 6 6 6 6 1 1 1 1 1 1 1 1 1 1 1 1 1 1 1 1 1 1 1 1 1 1 1 1
symmnumber: 1
zpe: 1161171.5 jmol-1
zpe.correction: 0.442267 hartree
zpe.thermalcorrener: 0.477520 hartree
zpe.thermalcorrenthalpy: 0.478464 hartree
zpe.thermalcorrgfe: 0.365850 hartree
zpe.sumelectzpe: -2110.459757 hartree
zpe.sumelectthermal: -2110.424505 hartree
zpe.sumelectthermalent: -2110.423560 hartree
zpe.sumelectthermalfe: -2110.536174 hartree
dipole: 10.4698 0.6822 -3.1631
dipole: 10.9584
quadrupole: -273.0434 -190.6410 -218.4277
quadrupole: 22.1392 -18.3416 3.8626
quadrupole: -45.6727 36.7297 8.9430 22.1392 -18.3416 3.8626
hfenergy: -2110.9020242 hartree
pointgroup: C01 [X(C22H24Cl1N5O7)]
dipole: -4.099297 0.2545561 -1.3110461 debye
polarizability: 873.9052717|-40.2374483|371.5937566|8.325595|27.2639269|183.9541704 unknown
InChI: InChI=1S/C22H24ClN5O7/c1-14(29)24-20-13-15(27(10-8-21(30)34-2)11-9-22(31)35-3)4-7-19(20)26-25-18-6-5-16(28(32)33)12-17(18)23/h4-7,12-13,24H,8-11H2,1-3H3
charge 0 multiplicity 1
59 atoms
Cl 4.463207 -3.598218 -0.843391
O  -5.510364 3.256567 0.061933
O  -5.44389 -4.255053 -2.109741
O  -5.96555 3.224382 2.346259
O  -5.499554 -4.180136 0.219527
O  -0.964414 3.803612 -0.126586
O  9.111343 0.518297 0.717181
O  9.319714 -1.64909 0.022623
N  -3.424506 -0.390538 0.13282
N  0.753392 2.206104 -0.132795
N  2.205967 -0.026152 -0.024852
N  2.933858 -1.133312 -0.044575
N  8.610563 -0.610208 0.32684
C  -4.261972 0.825709 0.017977
C  -4.146496 -1.670455 0.294247
C  -2.037421 -0.327169 0.092678
C  -4.44348 1.540332 1.381785
C  -4.379887 -2.38352 -1.059165
C  -1.37316 0.93716 0.001475
C  -1.238231 -1.530762 0.139239
C  0.028692 1.001829 -0.041047
C  0.825019 -0.205829 0.010918
C  0.149731 -1.460823 0.097313
C  -5.383856 2.736315 1.352994
C  -5.155879 -3.677942 -0.876067
C  0.269968 3.514074 -0.172822
C  1.34683 4.588966 -0.270406
C  -6.349246 4.475742 -0.062151
C  -6.190569 -5.53957 -2.066425
C  4.328379 -0.926084 0.023001
C  5.18282 -2.029459 -0.288959
C  4.951019 0.29091 0.446478
C  7.143507 -0.714164 0.22159
C  6.577185 -1.939255 -0.198386
C  6.341931 0.406566 0.547662
H  -5.248702 0.52329 -0.374129
H  -3.83483 1.522258 -0.720666
H  -5.120047 -1.460856 0.769974
H  -3.610709 -2.33658 0.990264
H  -3.463453 1.901207 1.749326
H  -4.825071 0.841217 2.147243
H  -3.418396 -2.612783 -1.555639
H  -4.933698 -1.731375 -1.759754
H  -1.91774 1.879949 -0.03441
H  -1.71428 -2.512113 0.204264
H  0.763412 -2.366071 0.12713
H  1.77005 2.03983 -0.162342
H  1.12589 5.239728 -1.133352
H  2.367616 4.184911 -0.378946
H  1.308005 5.222492 0.633105
H  -6.333947 4.718019 -1.133589
H  -5.915061 5.292939 0.536968
H  -7.374171 4.271089 0.289456
H  -5.615053 -6.294831 -1.505949
H  -7.169568 -5.393506 -1.58051
H  -6.307795 -5.829008 -3.119497
H  4.298018 1.128476 0.707329
H  7.227312 -2.782303 -0.442925
H  6.825466 1.329893 0.876278
