program: Gaussian 09
title: 000101877
version: EM64L-G09RevD.01
frameworkgroup: C1[X(C12H22O2)]
method: RPBEPBE
basis: SDD
operation: Freq
keyword: #pfreq=noraman
keyword: PBEPBE/SDD
title: #p freq=noraman PBEPBE/SDD
converged: YES YES NO NO
title: Mulliken charges:
elementType: O O C C C C C C C C C C C C H H H H H H H H H H H H H H H H H H H H H H
charge: -0.422058 -0.232091 -0.040982 -0.465554 -0.474712 -0.405057 -0.418156 -0.397851 -0.406454 -0.389733 -0.358315 -0.398477 -0.386154 0.122965 0.226519 0.229890 0.199042 0.201493 0.247879 0.217035 0.199222 0.205237 0.206203 0.202351 0.206341 0.200118 0.190750 0.203401 0.192852 0.197378 0.193984 0.200424 0.188091 0.197776 0.193236 0.373409
chargesum: 0.00000
title: Mulliken charges with hydrogens summed into heavy atoms:
elementType: O O C C C C C C C C C C C C
charge: -0.048650 -0.232091 0.185537 -0.036622 -0.025339 0.011199 -0.006716 0.010841 -0.015586 0.006520 0.033047 -0.009963 0.004857 0.122965
polarizability: 1.45520910e+02 1.07737136e+00 1.37486007e+02 -1.20726076e+00 -3.21295091e+00 1.11506701e+02
1716.lowfreq: -16.1420 0.0004 0.0005 0.0006 10.5071 15.6604 30.6458 45.1670 73.3468
frequency: 30.3644 45.0959 73.2000 139.0673 146.0546 157.5142 187.6639 206.1017 240.0790 262.8035 280.1916 303.4370 319.3650 342.4374 362.3558 379.9793 439.0362 451.1447 500.8583 507.6095 587.2537 612.4293 685.2108 716.3652 723.0570 749.6534 759.3808 775.0208 815.5599 841.1448 871.3304 896.1456 906.4804 927.8549 968.1845 979.2897 998.6744 1026.0064 1028.8307 1035.3103 1070.9543 1083.1961 1091.1389 1098.1513 1112.9661 1123.8724 1133.9089 1152.9424 1184.9353 1189.4117 1203.5275 1224.3019 1242.1040 1252.9370 1261.6374 1282.5195 1288.1638 1296.7794 1305.6156 1315.0438 1323.8206 1336.6443 1337.6475 1340.3037 1345.2330 1353.5468 1357.1191 1361.4807 1372.9912 1459.6745 1461.1004 1462.3794 1465.1557 1468.0503 1478.1805 1479.9562 1488.8152 1492.0724 1501.2795 1659.3801 2955.5780 2958.2325 2970.2530 2971.6931 2974.7058 2978.4739 2982.0638 2986.8800 2989.7789 2992.3396 3004.9949 3008.4991 3016.3628 3024.9503 3030.9589 3032.3411 3039.4331 3044.1878 3045.5326 3050.1622 3062.9652 3498.9415
redmass: 5.6350 7.7855 3.0496 3.0656 3.6249 3.2903 2.7484 2.4476 2.7282 2.1797 2.1053 2.2603 2.3373 1.9726 2.2173 2.4212 2.6560 2.2937 2.8218 2.3574 3.5972 1.2810 1.2723 3.3057 1.3739 1.7772 1.7223 2.1650 2.1527 2.2831 2.3725 1.9198 2.0812 1.8811 2.0889 1.7845 2.3549 1.7521 2.1394 2.6699 2.1826 2.1003 2.0472 2.5873 2.5335 2.4255 1.1856 1.2753 1.2769 1.2913 1.3188 1.1927 1.5004 1.2238 1.2242 1.2858 1.1590 1.1908 1.1977 1.2434 1.3432 1.2655 1.3773 1.3835 1.4336 1.4144 1.4017 1.4298 1.5866 1.0781 1.0858 1.0867 1.0861 1.0783 1.0914 1.0763 1.0758 1.0786 1.0870 7.8108 1.0603 1.0602 1.0623 1.0618 1.0637 1.0633 1.0619 1.0624 1.0638 1.0635 1.0967 1.0995 1.0963 1.0973 1.0996 1.0982 1.1018 1.1012 1.0978 1.0967 1.0852 1.0638
irintensity: 0.5808 1.3893 0.1921 0.0360 0.0218 0.0984 0.4370 0.7461 0.5526 0.3145 0.4750 1.6669 0.9008 0.3596 1.1754 0.4775 8.2381 1.9263 10.3177 5.0191 14.4017 106.2102 8.2691 40.0782 25.6762 9.3779 9.4557 0.3835 2.0779 0.7637 0.9895 1.8795 2.9374 3.3530 3.3554 1.9024 15.8744 7.7621 10.9995 202.5938 12.8727 22.3111 0.2432 2.2888 0.8228 0.3947 4.6523 2.9615 5.3034 3.3736 1.6824 4.2594 3.6699 2.5093 2.8480 1.1757 2.6363 2.5771 1.0438 2.5522 11.3781 1.3734 0.9375 0.1188 1.6171 1.0440 1.7165 0.6073 19.4017 3.4789 6.1975 18.5048 9.2420 2.0641 0.4604 12.0109 0.9200 19.4235 39.9782 220.3228 28.3052 34.9969 32.5888 27.6446 49.9010 24.8910 37.0633 12.7972 12.3682 30.4656 20.0470 7.8979 18.8493 16.9371 42.9496 87.4305 118.2078 130.0356 66.3948 35.3173 11.2705 15.8621
temp: 298.150 k
press: 1.00000 atm
elementType: 8 8 6 6 6 6 6 6 6 6 6 6 6 6 1 1 1 1 1 1 1 1 1 1 1 1 1 1 1 1 1 1 1 1 1 1
symmnumber: 1
zpe: 845495.5 jmol-1
zpe.correction: 0.322032 hartree
zpe.thermalcorrener: 0.336694 hartree
zpe.thermalcorrenthalpy: 0.337638 hartree
zpe.thermalcorrgfe: 0.280490 hartree
zpe.sumelectzpe: -619.780151 hartree
zpe.sumelectthermal: -619.765490 hartree
zpe.sumelectthermalent: -619.764546 hartree
zpe.sumelectthermalfe: -619.821694 hartree
dipole: -1.6644 -0.7939 0.4737
dipole: 1.9039
quadrupole: -93.2875 -85.9710 -86.5540
quadrupole: -5.5394 5.1094 0.1734
quadrupole: -4.6833 2.6332 2.0502 -5.5394 5.1094 0.1734
hfenergy: -620.1021837 hartree
pointgroup: C01 [X(C12H22O2)]
dipole: -0.6680788 -0.2821227 0.1875384 debye
polarizability: 145.6206054|0.8681944|136.99486|-0.5931949|-4.5827955|111.8981521 unknown
InChI: InChI=1S/C12H22O2/c13-12(14)11-9-7-5-3-1-2-4-6-8-10-11/h11,13H,1-10H2
charge 0 multiplicity 1
36 atoms
O  2.510644 -0.910575 1.532132
O  3.60762 0.378415 -0.04986
C  1.128105 0.181168 -0.133762
C  0.785503 -0.938195 -1.177719
C  0.986159 1.634625 -0.690862
C  0.396593 -2.309308 -0.564197
C  0.091768 2.555579 0.194761
C  -0.835649 -2.277278 0.382576
C  -1.388933 2.683627 -0.265108
C  -2.170741 -1.834343 -0.289172
C  -2.174352 1.361046 -0.461079
C  -3.041223 -0.867423 0.562483
C  -2.42004 0.533155 0.822946
C  2.528838 -0.061951 0.407443
H  0.437977 0.056187 0.71574
H  1.637027 -1.065826 -1.874997
H  -0.055213 -0.561846 -1.790477
H  0.571553 1.598251 -1.717101
H  1.995507 2.073885 -0.789965
H  1.258761 -2.722348 -0.005614
H  0.193639 -3.010688 -1.399565
H  0.520003 3.577451 0.206751
H  0.133224 2.202592 1.244865
H  -0.609436 -1.619906 1.244158
H  -0.961229 -3.288048 0.817658
H  -1.400604 3.233969 -1.22882
H  -1.92855 3.32379 0.463742
H  -2.776555 -2.731564 -0.52457
H  -1.960835 -1.359378 -1.266739
H  -1.641992 0.742462 -1.208065
H  -3.157351 1.599495 -0.91788
H  -3.259673 -1.347257 1.538855
H  -4.019572 -0.732515 0.055733
H  -3.095116 1.102725 1.494208
H  -1.473892 0.415938 1.386151
H  3.448435 -1.07001 1.82945
