program: Gaussian 09
title: 000101842
version: EM64L-G09RevD.01
frameworkgroup: C1[X(C6H5Cl7)]
method: RPBEPBE
basis: SDD
operation: Freq
keyword: #pfreq=noraman
keyword: PBEPBE/SDD
title: #p freq=noraman PBEPBE/SDD
converged: YES YES YES YES
title: Mulliken charges:
elementType: Cl Cl Cl Cl Cl Cl Cl C C C C C C H H H H H
charge: 0.080746 0.129241 0.079265 0.079265 0.042821 0.042822 0.045607 -0.384050 -0.349974 -0.349973 -0.373238 -0.373238 -0.373391 0.329813 0.329812 0.354375 0.354374 0.335724
chargesum: 0.00000
title: Mulliken charges with hydrogens summed into heavy atoms:
elementType: Cl Cl Cl Cl Cl Cl Cl C C C C C C
charge: 0.080746 0.129241 0.079265 0.079265 0.042821 0.042822 0.045607 -0.384050 -0.020161 -0.020161 -0.018863 -0.018864 -0.037668
polarizability: 1.44192481e+02 -3.59184913e-05 1.43970396e+02 4.15631142e+00 3.46980581e-05 9.61969519e+01
1716.lowfreq: -8.1652 0.0014 0.0015 0.0018 8.5496 11.0231 51.7406 55.0995 81.7466
frequency: 51.7285 55.0891 81.7465 137.1431 158.8633 166.7381 167.2614 171.0425 183.9149 193.3145 217.1689 246.6628 252.3214 286.6654 317.4419 372.4155 395.1761 467.0691 487.3976 551.2447 568.3045 694.4401 697.6179 699.5033 724.5229 828.9388 876.6289 985.0703 1022.2728 1025.3287 1074.2170 1093.5097 1096.0460 1176.0526 1185.1696 1189.1404 1202.6136 1227.6863 1267.2481 1290.4189 1298.9671 1317.7426 1322.2752 3062.8574 3069.3699 3079.4650 3104.9102 3109.3651
redmass: 25.6863 23.9707 27.7378 18.9446 29.6646 21.6593 30.9552 24.6722 29.4974 26.5139 20.2171 17.7710 20.1974 18.6491 15.7672 9.1873 4.6969 5.5142 4.7995 6.8994 9.4252 6.9772 6.8447 9.0870 4.9363 5.0574 5.8553 7.6535 8.0985 7.0470 3.8861 3.9364 3.7631 1.1388 1.1565 1.1495 1.1782 1.2818 1.1829 1.2492 1.2337 1.2230 1.2490 1.0853 1.0857 1.0867 1.0869 1.0865
irintensity: 0.1001 0.0683 0.2615 2.3728 0.0034 1.0845 0.3224 1.3677 0.4109 0.4755 1.0929 0.3767 0.0334 0.1224 0.2441 4.5292 1.7177 44.3136 15.8892 36.9394 43.8974 56.7429 19.8804 0.1979 28.8745 12.3670 28.3937 9.9631 13.1070 4.7171 1.3748 0.5096 0.0268 0.0965 1.3743 0.0011 24.4344 0.8324 2.2230 16.2777 6.5312 3.8254 0.7065 8.8678 0.1181 2.2360 0.8160 0.6285
temp: 298.150 k
press: 1.00000 atm
elementType: 17 17 17 17 17 17 17 6 6 6 6 6 6 1 1 1 1 1
symmnumber: 1
zpe: 264674.3 jmol-1
zpe.correction: 0.100809 hartree
zpe.thermalcorrener: 0.115102 hartree
zpe.thermalcorrenthalpy: 0.116046 hartree
zpe.thermalcorrgfe: 0.057806 hartree
zpe.sumelectzpe: -3451.051595 hartree
zpe.sumelectthermal: -3451.037303 hartree
zpe.sumelectthermalent: -3451.036358 hartree
zpe.sumelectthermalfe: -3451.094599 hartree
dipole: 0.0015 0.0000 -1.2067
dipole: 1.2067
quadrupole: -134.9661 -134.8877 -119.3679
quadrupole: 0.0000 0.8953 0.0000
quadrupole: -5.2255 -5.1471 10.3727 0.0000 0.8953 0.0000
hfenergy: -3451.1524043 hartree
pointgroup: C01 [X(C6H5Cl7)]
dipole: 0.0009478 -0.000001 -0.474756 debye
dipolederiv: -0.1761874 -0.0000026 0.0239875 -0.0000034 -0.1242243 -0.000004 -0.0362181 -0.0000073 -0.5830088 -0.5803542 -0.000029 -0.2185505 -0.0000292 -0.1193679 -0.0000141 -0.2246871 -0.0000144 -0.2567754 -0.2377404 -0.1647293 -0.0007579 -0.1632329 -0.4200621 0.0174083 0.0302687 0.0664392 -0.0708131 -0.2377778 0.1647503 -0.0007597 0.1632541 -0.4200273 -0.0174003 0.0302726 -0.066428 -0.070811 -0.2702849 0.1708161 0.0371742 0.1615332 -0.4293633 -0.0490188 0.0776693 -0.1338495 -0.1368181 -0.2702463 -0.1707966 0.0371728 -0.1615126 -0.4293948 0.0490298 0.0776579 0.1338651 -0.1368219 -0.5021863 -0.0000201 -0.090683 -0.0000212 -0.1678673 -0.000005 -0.1985376 -0.0000111 -0.1608479 0.6629288 0.0000281 0.30811 0.0000276 0.2388293 0.0000263 0.2183347 0.0000211 0.9995938 0.2092678 0.2058009 -0.0817004 0.1813526 0.3944825 -0.0923055 0.0041496 -0.1022843 -0.0296185 0.2093116 -0.2058252 -0.0817058 -0.1813746 0.3944428 0.0922867 0.0041429 0.102275 -0.0296225 0.2388626 -0.2024756 -0.1503037 -0.2203771 0.4156418 0.1903657 -0.1045234 0.1491378 0.1267777 0.2388149 0.2024523 -0.1502873 0.220355 0.4156823 -0.1903902 -0.104512 -0.1491561 0.126787 0.497669 0.0000251 0.2745123 0.0000238 0.1094013 0.0000173 0.203263 0.0000128 0.2085115 0.0449955 -0.0216511 0.0399538 -0.0146246 0.0154832 0.0222745 0.0091371 0.0596564 0.0002893 0.0449912 0.0216554 0.0399557 0.014628 0.0154853 -0.0222702 0.0091434 -0.0596554 0.0002907 0.059375 0.0205699 0.0362281 0.0224699 0.0219905 -0.0390462 0.0196078 -0.0197527 0.0192549 0.0593797 -0.0205645 0.0362242 -0.0224652 0.0219868 0.0390503 0.0196059 0.0197546 0.0192524 0.0091812 -0.000004 -0.0585702 -0.0000034 0.0668812 -0.0000046 -0.0347746 -0.000003 -0.0256201 unknown
polarizability: 144.1863013|0.0000254|143.9703962|4.1918381|-0.0002998|96.2031321 unknown
InChI: InChI=1S/C6H5Cl7/c7-1-2(8)4(10)6(12,13)5(11)3(1)9/h1-5H
charge 0 multiplicity 1
18 atoms
Cl -1.580292 -0.000091 1.862977
Cl -3.028139 -0.000206 -0.824435
Cl -1.490467 -2.81756 0.072632
Cl -1.490789 2.817345 0.072568
Cl 1.780682 -2.734516 -0.613152
Cl 1.780373 2.734656 -0.613219
Cl 3.22367 0.000168 0.809885
C  -1.353022 -0.0001 0.002157
C  -0.580323 -1.268214 -0.433009
C  -0.580469 1.268092 -0.433039
C  0.846931 -1.290622 0.149815
C  0.846785 1.290678 0.149782
C  1.624227 0.000067 -0.178322
H  -0.554854 -1.301813 -1.536005
H  -0.555005 1.301668 -1.536036
H  0.824496 -1.490146 1.231466
H  0.824326 1.490224 1.231429
H  1.939669 0.000071 -1.234293
