program: Gaussian 09
title: 000101900
version: EM64L-G09RevD.01
frameworkgroup: C1[X(C23H33NO)]
method: RPBEPBE
basis: SDD
operation: Freq
keyword: #p
keyword: freq=noraman
keyword: PBEPBE/SDD
title: #p freq=noraman PBEPBE/SDD
converged: YES YES NO NO
title: Mulliken charges:
elementType: O N C C C C C C C C C C C C C C C C C C C C C C C H H H H H H H H H H H H H H H H H H H H H H H H H H H H H H H H H
charge: -0.183864 -0.198327 -0.151505 -0.103695 -0.154404 0.315244 0.265389 -0.549794 -0.521907 -0.533093 -0.501227 0.040193 0.583242 -0.513424 -0.538169 -0.799886 -0.506641 -0.843654 -0.524230 -0.660346 0.378151 -0.377355 -0.352032 -0.457598 -0.461332 0.239755 0.204607 0.213500 0.223585 0.215653 0.210912 0.220880 0.233424 0.216594 0.209752 0.205015 0.245756 0.244353 0.220394 0.214647 0.226528 0.237780 0.237785 0.201352 0.223029 0.211427 0.242073 0.211615 0.231435 0.230314 0.233641 0.213509 0.221159 0.210261 0.221492 0.227295 0.223028 0.227714
chargesum: 0.00000
title: Mulliken charges with hydrogens summed into heavy atoms:
elementType: O N C C C C C C C C C C C C C C C C C C C C C C C
charge: -0.183864 -0.198327 0.088250 0.100912 0.059096 0.315244 0.265389 -0.110556 -0.090114 -0.083075 -0.086460 0.040193 0.583242 -0.023315 -0.103128 -0.097793 -0.305289 -0.167127 -0.081180 -0.430033 0.378151 0.069795 0.079388 -0.008811 -0.010590
polarizability: 3.68924253e+02 -2.58851670e+01 2.37806921e+02 3.60799174e+00 -5.53630025e-01 1.77688119e+02
1716.lowfreq: -12.0466 -0.0008 -0.0006 -0.0002 3.5093 5.2760 26.5832 46.4673 56.5975
frequency: 26.4095 45.7857 56.5271 67.1779 72.1810 88.4930 117.0457 135.3493 152.6764 154.9954 167.9335 183.7498 187.6387 202.0414 227.6064 238.2894 254.3148 259.6188 265.2758 275.5332 281.7814 302.9917 311.1811 360.9785 370.0977 377.6193 402.7073 412.7503 449.8418 461.1551 481.1153 509.7703 514.8028 532.9260 556.8480 569.1635 571.2768 583.2712 611.3831 646.5218 675.3729 698.8619 710.4340 742.2217 772.0889 778.6901 812.2806 818.9935 824.8230 830.6139 846.0227 863.8172 867.9844 875.0737 904.6970 914.4203 918.5251 924.4509 928.6518 945.4581 951.0708 967.9021 974.2956 986.5425 988.3050 991.8744 1008.2186 1010.5211 1036.1872 1044.5773 1053.1714 1064.2429 1076.7267 1080.7979 1093.2377 1116.5271 1122.4888 1128.1794 1134.8162 1142.1379 1143.9463 1148.8813 1167.2405 1168.5243 1175.0404 1186.9586 1195.2349 1210.1091 1212.1440 1217.1782 1222.7507 1237.1148 1240.3049 1244.5055 1248.1540 1255.6821 1265.3678 1285.8568 1292.7504 1296.0957 1304.1110 1312.0967 1319.9082 1322.3775 1323.1185 1327.7754 1329.7079 1333.1428 1336.8183 1343.1168 1351.1244 1356.6564 1363.6642 1370.9415 1382.4200 1388.8964 1410.7714 1426.5136 1455.1956 1457.7394 1460.1899 1463.9332 1467.2674 1470.6702 1472.0839 1473.6414 1476.2778 1485.9890 1488.4088 1493.7651 1495.7373 1502.4833 1617.3798 1647.9751 1652.0250 2897.8858 2900.7738 2919.1298 2925.6135 2935.2706 2956.4572 2962.1685 2975.3508 2976.1063 2978.2158 2984.6704 2985.9115 2990.5370 2996.0908 2996.6108 2997.5477 3001.7848 3012.0201 3013.5416 3016.4392 3034.4670 3042.1865 3047.0726 3055.4145 3069.6405 3070.0784 3074.2571 3076.7251 3077.9560 3080.7303 3087.5893 3089.5259 3114.2102
redmass: 4.5839 2.8845 4.0828 2.9082 4.1465 3.5185 2.6798 2.5837 1.8933 2.5557 2.2959 1.9948 3.1899 1.9534 2.7424 1.5905 2.1851 1.6834 2.5659 2.3497 2.7552 2.7764 2.9757 2.6196 2.7577 2.8988 3.4812 4.1956 3.1954 3.2873 3.3929 2.5141 3.1199 2.4406 3.2014 3.4002 1.8940 3.8596 3.7666 3.5007 3.3538 2.9049 3.1791 2.6099 1.4046 2.0158 1.8554 1.9831 2.0351 2.0522 1.7678 1.9046 1.7269 2.1065 2.2437 1.9510 2.5368 1.4410 1.7506 2.2181 2.0164 2.1191 2.0306 1.8213 1.8412 2.2738 1.8648 2.2630 1.9681 2.0343 2.3666 1.7393 2.6284 2.4488 1.6519 1.5929 2.1760 2.6113 1.4503 1.6543 1.8827 1.6431 1.5643 1.6437 2.2562 2.1108 1.4283 1.8768 1.6067 1.6330 1.3208 2.0276 1.3207 1.3773 1.3680 1.6618 1.5373 1.4132 1.3439 1.4089 1.3470 1.2438 1.5193 1.3498 1.5151 1.3884 1.6729 1.4191 1.5255 1.3911 1.5065 2.4068 1.5616 1.6539 1.1884 1.3024 3.7908 1.0803 1.0904 1.0924 1.0746 1.0853 1.0886 1.0681 1.0838 1.0971 1.0618 1.0751 1.0672 1.0769 1.0654 1.0914 7.1085 6.7939 11.9885 1.0776 1.0711 1.0813 1.0663 1.0667 1.0640 1.0846 1.0576 1.0585 1.0457 1.0685 1.0512 1.0605 1.0859 1.0605 1.0859 1.0668 1.0822 1.0751 1.0794 1.0987 1.1006 1.1017 1.0981 1.1011 1.0987 1.1005 1.0993 1.0893 1.0981 1.1053 1.0987 1.0888
irintensity: 0.0386 0.3974 3.5206 0.8210 2.3151 0.0929 0.0845 1.9927 0.5819 2.0108 0.2770 1.9361 2.0111 0.0428 1.1738 0.5444 0.4564 0.4602 0.7245 1.1567 0.2456 1.6970 2.2684 1.3334 0.9550 0.2815 1.0285 0.4173 2.3789 0.8003 0.7668 0.9701 0.4583 0.3745 2.7742 3.0791 2.2929 0.9028 1.6503 7.6522 1.0694 0.5462 1.4963 0.6759 0.6158 1.4050 7.5789 1.7750 16.9583 9.2474 42.6707 1.8493 5.6504 1.9128 3.7883 5.9782 5.7881 0.2456 5.1621 31.1543 2.4151 6.5950 20.5218 7.1185 4.8446 0.5510 1.1488 40.6083 9.8489 3.1473 25.6457 2.0142 6.5834 12.5498 7.2574 5.8819 4.9225 2.6565 2.1637 0.9836 1.7400 10.7621 2.0609 15.1973 16.9321 9.9247 0.5058 28.4741 15.7882 23.2696 19.6612 5.0236 8.2003 8.1133 4.5524 1.1217 1.9692 5.5999 7.3749 6.5771 2.7793 0.6169 17.6238 2.0466 18.0523 1.3079 6.9018 8.8211 4.3256 0.9950 22.8369 40.5883 13.1279 14.0041 20.1791 33.4595 214.6523 17.6056 40.6486 3.6454 2.9885 8.1242 9.0181 9.2432 7.0869 13.9310 6.6373 7.3456 2.1595 4.8019 16.1535 22.2952 287.7587 156.5568 185.3689 23.0774 68.5837 21.0255 78.6535 56.8820 59.1285 22.8982 42.0940 14.6361 14.9660 16.7552 29.2225 41.7663 7.4139 45.6239 11.1471 22.9282 2.9375 80.1321 82.3686 26.1289 73.0845 32.5313 10.8141 27.6844 44.1840 48.6787 20.2615 37.9450 43.9345 58.0478 26.7516 42.4047
temp: 298.150 k
press: 1.00000 atm
elementType: 8 7 6 6 6 6 6 6 6 6 6 6 6 6 6 6 6 6 6 6 6 6 6 6 6 1 1 1 1 1 1 1 1 1 1 1 1 1 1 1 1 1 1 1 1 1 1 1 1 1 1 1 1 1 1 1 1 1
symmnumber: 1
zpe: 1338333.4 jmol-1
zpe.correction: 0.509744 hartree
zpe.thermalcorrener: 0.533263 hartree
zpe.thermalcorrenthalpy: 0.534208 hartree
zpe.thermalcorrgfe: 0.458129 hartree
zpe.sumelectzpe: -1024.295371 hartree
zpe.sumelectthermal: -1024.271852 hartree
zpe.sumelectthermalent: -1024.270908 hartree
zpe.sumelectthermalfe: -1024.346987 hartree
dipole: 5.9307 0.7533 0.8451
dipole: 6.0378
quadrupole: -153.6206 -149.7996 -152.3642
quadrupole: -16.5934 -6.9039 -1.7259
quadrupole: -1.6925 2.1285 -0.4360 -16.5934 -6.9039 -1.7259
hfenergy: -1024.8051155 hartree
pointgroup: C01 [X(C23H33N1O1)]
dipole: 2.3363429 0.2854803 0.3204961 debye
polarizability: 368.6746987|-26.5687312|238.0797744|2.8597554|-0.7361475|177.6648206 unknown
InChI: InChI=1S/C23H33NO/c1-22-11-9-17(24-13-3-4-14-24)15-16(22)5-6-18-19-7-8-21(25)23(19,2)12-10-20(18)22/h5,15,18-20H,3-4,6-14H2,1-2H3
charge 0 multiplicity 1
58 atoms
O  -6.322439 -1.123348 -0.642793
N  4.760694 -0.07646 -0.109148
C  -1.833682 0.813909 0.229027
C  -1.053519 -0.427095 -0.321764
C  -3.292912 0.743326 -0.258068
C  -4.022299 -0.565937 0.160926
C  0.437021 -0.44475 0.186205
C  -1.802198 -1.770312 -0.059465
C  -3.297634 -1.764152 -0.483244
C  -4.297605 1.87169 0.098731
C  -1.158932 2.129126 -0.229835
C  -5.457129 -0.274396 -0.318883
C  1.095146 0.928512 -0.060635
C  -5.662938 1.259759 -0.32956
C  1.257948 -1.495402 -0.623653
C  -4.149873 -0.751668 1.707497
C  0.350627 2.071931 -0.208494
C  0.527317 -0.776776 1.707982
C  2.749926 -1.539907 -0.228656
C  2.557112 0.972572 -0.11044
C  3.367873 -0.150718 -0.153532
C  5.477426 1.193304 0.128034
C  5.688725 -1.216145 -0.299137
C  6.930374 0.751517 0.417615
C  7.078396 -0.542712 -0.421555
H  -1.817978 0.786736 1.337798
H  -1.004419 -0.289263 -1.427488
H  -3.242766 0.716247 -1.373367
H  -1.736424 -2.029374 1.014463
H  -1.292282 -2.58809 -0.603073
H  -3.374253 -1.683045 -1.586435
H  -3.779324 -2.718597 -0.198294
H  -4.078718 2.815512 -0.429397
H  -4.280299 2.090532 1.183005
H  -1.52133 2.971481 0.396233
H  -1.500759 2.366901 -1.264665
H  -5.937561 1.556113 -1.360771
H  -6.517202 1.538433 0.313659
H  1.175816 -1.247455 -1.70094
H  0.828141 -2.505362 -0.484629
H  -4.669047 0.094896 2.192026
H  -4.730435 -1.667983 1.917839
H  -3.161079 -0.852989 2.184961
H  0.87991 3.022143 -0.378677
H  -0.169853 -0.152679 2.294359
H  0.296572 -1.840013 1.9083
H  1.542955 -0.569532 2.087215
H  3.294076 -2.163595 -0.964428
H  2.869192 -2.051804 0.74946
H  3.012697 1.970303 -0.131534
H  5.02115 1.740076 0.976556
H  5.424622 1.858812 -0.761902
H  5.443425 -1.80066 -1.206678
H  5.657477 -1.914184 0.565165
H  7.049349 0.524419 1.493139
H  7.667642 1.526047 0.146733
H  7.279905 -0.286311 -1.478005
H  7.891675 -1.198581 -0.067387
