program: Gaussian 09
title: 000101820
version: EM64L-G09RevD.01
frameworkgroup: C1[X(C6H9ClN4O4S2)]
method: RPBEPBE
basis: SDD
operation: Freq
keyword: #p
keyword: freq=noraman
keyword: PBEPBE/SDD
title: #p freq=noraman PBEPBE/SDD
converged: YES YES NO NO
title: Mulliken charges:
elementType: Cl S S O O O O N N N N C C C C C C H H H H H H H H H
charge: 0.002428 0.935625 0.944287 -0.496528 -0.554274 -0.542156 -0.509320 -0.413892 -0.702227 -0.708983 -0.565459 -0.289702 -0.019430 0.522549 -0.227151 -0.079751 -0.299881 0.343801 0.319216 0.359383 0.330945 0.345792 0.345590 0.335455 0.310476 0.313206
chargesum: 0.00000
title: Mulliken charges with hydrogens summed into heavy atoms:
elementType: Cl S S O O O O N N N N C C C C C C
charge: 0.002428 0.935625 0.944287 -0.496528 -0.554274 -0.542156 -0.509320 -0.054509 -0.025489 -0.027938 0.058223 -0.289702 -0.019430 0.522549 0.116650 -0.079751 0.019335
polarizability: 2.36544571e+02 5.34408332e+00 1.85178750e+02 2.46819254e+00 1.82894605e+00 1.10293485e+02
1716.lowfreq: -7.4471 -7.0124 -5.3814 -0.0031 -0.0030 -0.0023 38.2125 45.6335 53.5860
frequency: 38.2078 45.6184 53.5817 78.3472 101.5285 115.0399 132.9102 137.9813 152.7291 176.6142 196.5702 198.8627 207.9344 215.1212 237.0652 251.5549 259.1589 285.7230 305.4874 314.8548 323.3332 339.6850 374.1298 397.1590 409.3050 435.2848 448.6014 466.0765 482.6949 501.3975 570.9056 593.7112 648.1640 655.2606 689.7610 741.3327 763.2430 777.5581 785.3344 803.7924 807.4476 890.0529 914.2007 919.4211 920.3395 949.1173 994.0916 1057.9870 1068.4730 1088.1940 1143.9535 1205.6622 1242.9502 1275.4276 1351.5172 1425.2063 1452.9571 1506.3177 1525.7596 1539.1864 1578.6217 1603.9343 1671.4921 3119.6637 3183.7611 3275.1530 3364.4633 3375.2934 3444.5881 3531.4184 3546.4328 3574.5609
redmass: 8.2694 7.0115 6.2469 4.9462 7.8087 1.7235 2.8780 3.2217 6.8686 5.2433 3.9353 3.3273 5.4007 8.1542 7.4157 5.2327 3.4530 3.7396 5.4516 2.2814 2.0500 4.0823 9.0501 8.9980 7.0073 5.5963 4.1678 4.5959 5.8675 4.7460 3.7598 1.9454 3.8188 9.6274 4.8457 1.3266 2.3946 4.1494 1.7588 2.0252 11.1460 6.3763 4.5362 4.3938 1.7860 1.3512 5.9136 1.3666 1.5127 1.7226 5.7423 1.2094 1.1810 3.7912 3.6221 8.7913 3.6471 3.2688 1.0880 1.0877 2.1206 3.6947 1.2561 1.0916 1.0913 1.0823 1.0416 1.0411 1.0414 1.1003 1.1010 1.1039
irintensity: 2.8735 3.2269 4.4539 3.3592 0.6633 26.7622 5.4705 6.7195 1.0149 4.1625 5.4782 9.2393 11.9515 12.6318 2.3310 8.5232 5.9838 6.8817 5.9654 12.6791 13.9490 15.7959 77.2536 38.5952 17.1132 114.9801 138.3162 28.5777 41.5826 97.6580 22.7768 100.7113 54.6479 3.0009 14.3418 84.4238 38.3181 135.6385 200.4366 62.5439 82.3142 51.5872 50.2844 112.1339 63.7103 12.5125 12.8211 34.4846 6.3831 30.3465 31.7535 24.0183 0.1563 1.1852 55.1371 10.3316 63.3223 18.2555 32.4715 27.9435 55.8950 211.4014 106.5048 26.8450 9.3215 175.1404 31.2608 34.7526 1.2832 24.5572 27.6740 8.7162
temp: 298.150 k
press: 1.00000 atm
elementType: 17 16 16 8 8 8 8 7 7 7 7 6 6 6 6 6 6 1 1 1 1 1 1 1 1 1
symmnumber: 1
zpe: 438187.7 jmol-1
zpe.correction: 0.166897 hartree
zpe.thermalcorrener: 0.186661 hartree
zpe.thermalcorrenthalpy: 0.187605 hartree
zpe.thermalcorrgfe: 0.118724 hartree
zpe.sumelectzpe: -2008.433298 hartree
zpe.sumelectthermal: -2008.413534 hartree
zpe.sumelectthermalent: -2008.412590 hartree
zpe.sumelectthermalfe: -2008.481471 hartree
dipole: 3.3169 4.9736 0.2546
dipole: 5.9836
quadrupole: -112.5382 -119.8129 -123.5732
quadrupole: 8.9707 24.4794 -6.3205
quadrupole: 6.1032 -1.1714 -4.9318 8.9707 24.4794 -6.3205
hfenergy: -2008.6001949 hartree
pointgroup: C01 [X(C6H9Cl1N4O4S2)]
dipole: -1.4463821 -1.8505678 0.1589423 debye
dipolederiv: -0.479959 0.3039957 0.0395189 0.3183263 -0.3533963 -0.0180216 0.0508534 -0.0159272 -0.0176218 1.6533625 -0.4156902 -0.1861103 -0.5670576 1.5852335 0.1680826 -0.2714236 0.2461545 1.6473246 2.2614328 0.4323714 -0.2781218 0.4828972 1.3119216 -0.042732 -0.2438888 -0.0242897 1.544166 -0.5703014 0.0380958 0.109877 0.1328355 -0.729281 0.1155732 0.050719 -0.0167474 -0.5532172 -0.7842145 0.0386774 -0.0613554 0.0682432 -0.6920664 -0.1344862 0.0426882 -0.0632631 -0.5331544 -0.6833418 -0.0815609 0.0782513 -0.1129186 -0.6781958 -0.0485953 0.0309188 0.0794864 -0.485691 -0.808165 -0.0891518 -0.0679842 -0.0665181 -0.4676763 0.1237155 -0.049345 -0.0047497 -0.6220879 -0.9655173 -0.2981667 0.0554629 -0.2449466 -0.1747329 -0.0189697 0.095451 0.0652486 -0.3940047 -0.5512016 0.171637 0.1143321 0.1365946 -0.5400718 -0.0194072 0.2243588 -0.0607644 -0.848217 -0.7655897 -0.0957436 0.1478216 -0.080363 -0.3959845 -0.1188153 0.2440174 -0.0714341 -0.8197407 -0.5669681 0.0680211 -0.0067165 0.2471359 -0.1389544 0.0088094 -0.0252508 -0.0100871 -0.0186111 -0.4582373 0.0241606 -0.0088197 -0.380759 -0.3965425 0.0121335 -0.0608426 0.0419758 -0.2566292 -0.6666666 0.1672115 0.0141163 -0.0931054 -0.6821938 0.0028102 -0.0554835 -0.0411872 -0.1899317 1.1748656 0.8966099 -0.0092462 0.2908899 0.3501968 0.0013846 -0.0145266 -0.0010623 0.1778234 0.4101892 -0.2351422 -0.0284472 0.0204137 -0.2606892 -0.0089134 -0.0101738 -0.0036953 -0.0088952 0.8435469 -0.3927606 -0.039438 -0.0894989 0.9892583 0.0224017 -0.0619651 0.0274002 -0.0084808 -0.7997983 -0.2401985 0.0239447 0.1601434 -0.1862609 -0.0110951 0.0148365 -0.0324046 -0.1323546 0.2453959 0.0094865 -0.0208072 0.0204832 0.1435543 -0.004469 -0.0146827 0.0036194 0.1432516 0.0997034 0.0347285 0.0058285 0.0398442 0.0724183 -0.0039038 -0.0018331 -0.0032752 0.1733816 0.2860099 -0.1211988 -0.0258648 -0.1521908 0.2782407 0.048932 -0.0345138 -0.0386478 0.288433 0.1512557 -0.0734034 0.084288 -0.0946952 0.185301 -0.0447804 0.0143332 -0.034095 0.1594348 0.1648316 0.0404257 -0.0691513 0.1022185 0.218548 -0.0690165 0.0042397 -0.0639188 0.1387063 0.1631249 -0.0150565 0.1166267 0.0248731 0.1095848 -0.0404301 0.0447606 -0.0146167 0.2507506 0.1695978 0.0628951 0.005559 0.0478524 0.2224305 0.0852984 0.0267911 0.0514627 0.1233463 0.2507805 -0.1052874 -0.0976114 -0.1126251 0.1082432 0.0250145 -0.0421891 0.0079405 0.115291 0.2258637 -0.1249557 0.1040469 -0.0980726 0.1211145 -0.0305202 0.0421508 -0.0231225 0.1267282 unknown
polarizability: 236.0166061|1.3516556|184.6942062|-11.7607037|0.1645569|111.3059934 unknown
InChI: InChI=1S/C6H9ClN4O4S2/c7-3-1-4(11-8)6(17(10,14)15)2-5(3)16(9,12)13/h1-2,11H,8-10H2
charge 0 multiplicity 1
26 atoms
Cl 2.554444 -2.431433 -0.115644
S  -2.537528 1.532267 0.120317
S  2.961289 0.949047 -0.066825
O  -2.055959 2.986387 -0.414298
O  -3.880533 0.805566 -0.48784
O  2.615535 2.538091 -0.165337
O  3.90718 0.358037 1.111354
N  -2.581032 -1.626242 0.024138
N  -2.881384 1.538947 1.921086
N  3.655238 0.486977 -1.697534
N  -2.73709 -3.025914 0.036359
C  -1.098639 0.343084 0.015781
C  1.292232 0.081809 -0.06387
C  -1.315676 -1.073226 0.01576
C  0.173168 0.924976 -0.042139
C  1.12575 -1.320036 -0.047168
C  -0.146185 -1.89513 -0.013148
H  0.307434 2.014359 -0.078519
H  -0.292446 -2.977572 -0.01773
H  -3.387327 -0.988882 -0.112333
H  -2.241825 2.189368 2.407123
H  -3.879888 1.771902 2.055076
H  3.937987 1.355963 -2.179806
H  4.422493 -0.189742 -1.55988
H  -3.132403 -3.404196 -0.830433
H  -3.173536 -3.377906 0.893709
