program: Gaussian 09
title: 000102003
version: EM64L-G09RevD.01
frameworkgroup: C1[X(C21H30O6)]
method: RPBEPBE
basis: SDD
operation: Freq
keyword: #pfreq=noraman
keyword: PBEPBE/SDD
title: #p freq=noraman PBEPBE/SDD
converged: YES YES NO NO
title: Mulliken charges:
elementType: O O O O O O C C C C C C C C C C C C C C C C C C C C C H H H H H H H H H H H H H H H H H H H H H H H H H H H H H H
charge: -0.467585 -0.458988 -0.476107 -0.243913 -0.446292 -0.236797 0.380687 -0.107898 -0.189056 -0.155301 0.095558 -0.638177 0.241133 -0.155974 -0.580882 -0.246833 -0.473895 -0.833083 0.535440 -0.637942 -0.499781 -0.793516 0.051478 -0.571587 -0.590301 0.178750 -0.361822 0.262374 0.258870 0.219216 0.270260 0.210009 0.224445 0.249698 0.248970 0.280065 0.224755 0.216976 0.217544 0.277111 0.229819 0.227202 0.234343 0.211954 0.232805 0.277928 0.216975 0.211060 0.378195 0.243974 0.233280 0.342528 0.254244 0.371016 0.242320 0.248498 0.366249
chargesum: 0.00000
title: Mulliken charges with hydrogens summed into heavy atoms:
elementType: O O O O O O C C C C C C C C C C C C C C C C C C C C C
charge: -0.089389 -0.116460 -0.105091 -0.243913 -0.080043 -0.236797 0.380687 0.154477 0.069814 0.063915 0.095558 -0.157908 0.241133 0.068471 -0.082214 0.033232 -0.032165 -0.108609 0.535440 -0.176397 -0.055021 -0.087553 0.051478 -0.094333 -0.336058 0.178750 0.128996
polarizability: 3.09026661e+02 6.29030856e-01 2.19402291e+02 -2.12192203e+01 5.28375323e+00 1.92448427e+02
1716.lowfreq: -16.5895 -7.9645 -6.3381 -0.0006 0.0006 0.0009 25.7026 32.9024 48.8810
frequency: 25.4868 32.7669 48.8400 57.4841 67.2695 77.3562 111.4881 126.3709 138.0302 149.9299 168.4205 181.5045 196.1703 199.5272 214.2854 219.6651 227.9929 236.5293 248.2472 254.9295 273.5034 279.5059 297.4875 304.7090 308.4682 323.3420 339.5527 345.4616 360.1296 371.6373 375.2424 386.4695 403.8790 416.1444 431.4570 451.3136 467.9817 485.0787 497.9400 512.8358 522.5862 528.1129 537.9304 567.5641 603.9043 624.8586 642.1503 651.8342 680.1398 714.1665 742.1984 752.1148 762.6290 774.7344 787.9741 800.7311 839.9487 847.7880 853.0144 872.5440 881.7617 899.6923 909.3060 918.3034 929.6439 940.6710 951.4728 967.6743 979.4952 984.0178 1004.5135 1009.0122 1024.9861 1026.2910 1031.7117 1033.5544 1048.4550 1063.0820 1073.9762 1085.4478 1107.6245 1115.8964 1116.3790 1124.7170 1131.0978 1145.6010 1156.3694 1163.6687 1165.9132 1176.3981 1179.7958 1187.9015 1197.9427 1205.9416 1208.7397 1226.6931 1239.0677 1245.2545 1250.5355 1262.4405 1274.2219 1278.5808 1279.0589 1287.9970 1291.6196 1311.7653 1323.1288 1326.6378 1329.8178 1340.0960 1343.2351 1345.6315 1347.9390 1352.6868 1359.6280 1373.9141 1376.0036 1377.9070 1385.1957 1394.3547 1404.6093 1430.1510 1443.5428 1455.7484 1457.3816 1464.8374 1467.3340 1468.0220 1472.0124 1474.0938 1492.1733 1496.5315 1584.8871 1586.6058 1624.1111 2919.3614 2948.4182 2949.5201 2959.8290 2962.6633 2963.1197 2968.8691 2981.3750 2982.6119 2987.8290 2992.1681 2994.4074 3006.9538 3016.1890 3032.3031 3038.9197 3040.3790 3043.3606 3050.5557 3063.8380 3070.7974 3076.1757 3082.4670 3104.7088 3117.1539 3123.5322 3317.1677 3424.3607 3551.0727 3598.3805
redmass: 6.8225 5.2853 8.7580 4.6033 3.9037 3.6031 3.8147 3.1644 3.8244 4.3889 2.3398 2.9017 2.8263 3.0287 3.5508 1.8330 1.8248 2.2768 1.8636 2.1643 2.4961 2.7492 2.9919 1.1709 3.2900 5.7908 3.5141 3.3266 2.7892 3.3096 2.5772 1.3570 3.1350 3.9907 3.5518 2.6856 2.7797 2.8608 3.2422 3.3951 2.9780 2.5491 3.8465 3.0407 3.5646 3.6802 3.2689 1.1750 3.6482 3.5035 4.5753 4.1401 3.1857 2.4570 3.0711 2.2605 2.8162 2.7525 3.1256 2.8786 1.4982 2.6551 2.0157 2.1616 1.7999 2.0123 1.8761 2.4071 2.3023 2.7514 2.4015 2.6622 3.6332 2.3387 2.1146 2.0731 2.2563 2.4745 3.2008 2.5809 2.0748 1.8783 2.2783 1.8678 1.7682 1.5640 1.8499 1.6212 1.2910 1.5239 1.6455 1.8675 2.0541 1.3596 1.5782 1.3389 1.5266 1.7369 1.6072 1.4703 1.6057 1.7900 1.4656 1.4057 1.4689 1.4731 1.4104 1.4167 1.4336 1.5122 1.8516 1.4019 1.4072 1.3888 1.3429 1.4032 1.3305 1.3933 1.4296 1.2506 1.1914 1.0838 1.0781 1.0720 1.0806 1.0848 1.0826 1.0896 1.0639 1.0736 1.0551 1.0551 9.9568 8.0678 7.7859 1.0803 1.0806 1.0702 1.0672 1.0747 1.0609 1.0698 1.0583 1.0636 1.0396 1.0550 1.0639 1.0645 1.0996 1.0967 1.0936 1.0976 1.0974 1.0876 1.0960 1.0963 1.0978 1.0997 1.0997 1.0911 1.0977 1.0642 1.0642 1.0658 1.0670
irintensity: 2.1728 0.7646 2.2349 2.3100 4.9753 8.9980 1.4787 2.4835 0.4635 5.7859 2.6360 8.8604 12.5288 3.0904 0.5601 8.0224 5.3601 9.4331 48.2632 2.6363 2.4511 30.0133 0.8667 150.4539 3.9717 35.3309 0.6013 5.0165 2.1929 0.8897 7.0381 95.1473 0.6410 10.8696 5.1873 3.3958 2.7582 8.6738 13.0074 8.7322 1.6147 0.6902 13.5021 1.4705 0.8237 9.6432 6.3649 112.7559 2.5552 10.2131 5.4281 1.2597 6.1234 3.2154 10.8973 1.9749 5.6548 20.6000 10.2733 31.1439 12.7375 51.4543 25.2444 1.7861 11.0939 18.2897 4.8566 5.5575 1.3177 96.4354 2.4704 26.3891 77.0794 32.4245 11.1342 5.5870 10.2608 14.2946 42.3115 17.4849 5.1301 12.4256 6.4462 7.7582 11.2067 4.9368 2.2277 9.6983 6.8235 25.0604 6.2634 23.3293 19.3414 31.8850 35.2873 20.1407 26.3978 16.9661 126.7515 5.5197 21.5918 7.8131 30.4035 4.7095 14.6569 16.3645 2.3611 4.1504 10.1689 9.8181 3.4872 23.2876 38.6996 6.7120 3.3030 5.3642 18.4751 56.4444 1.3519 21.7001 26.2150 25.1138 21.8308 3.3386 29.3491 14.9513 8.7251 9.0247 4.2947 0.6047 4.6880 6.0442 196.4952 50.8739 196.1647 8.0710 5.0948 34.6727 17.6339 26.5434 29.6249 64.9808 30.3822 16.5189 16.8736 11.3268 44.7794 13.5089 14.5827 48.0024 8.3660 29.3270 33.4989 9.0967 23.8666 30.4250 38.4824 10.6256 10.9950 10.9945 4.9871 121.5135 20.2108 5.0310 25.6413
temp: 298.150 k
press: 1.00000 atm
elementType: 8 8 8 8 8 8 6 6 6 6 6 6 6 6 6 6 6 6 6 6 6 6 6 6 6 6 6 1 1 1 1 1 1 1 1 1 1 1 1 1 1 1 1 1 1 1 1 1 1 1 1 1 1 1 1 1 1
symmnumber: 1
zpe: 1252982.7 jmol-1
zpe.correction: 0.477236 hartree
zpe.thermalcorrener: 0.503664 hartree
zpe.thermalcorrenthalpy: 0.504608 hartree
zpe.thermalcorrgfe: 0.422703 hartree
zpe.sumelectzpe: -1267.459040 hartree
zpe.sumelectthermal: -1267.432613 hartree
zpe.sumelectthermalent: -1267.431668 hartree
zpe.sumelectthermalfe: -1267.513573 hartree
dipole: -4.0868 2.3114 2.2374
dipole: 5.2010
quadrupole: -217.5949 -154.1835 -167.6832
quadrupole: -17.8833 14.7210 0.2808
quadrupole: -37.7744 25.6371 12.1373 -17.8833 14.7210 0.2808
hfenergy: -1267.9362762 hartree
pointgroup: C01 [X(C21H30O6)]
dipole: 1.6345253 0.9206122 -0.8171992 debye
polarizability: 309.5819014|-1.1002005|219.8246282|-19.6562579|-3.7624969|191.4708497 unknown
InChI: InChI=1S/C21H30O6/c1-19-6-5-12(23)7-11(19)3-4-13-14-8-16(25)21(27,17(26)10-22)20(14,2)9-15(24)18(13)19/h7,13-16,18,22,24-25,27H,3-6,8-10H2,1-2H3
charge 0 multiplicity 1
57 atoms
O  2.902099 0.205732 1.91554
O  -0.468935 -2.180309 -1.406118
O  3.697449 2.545925 1.152908
O  5.068989 -0.368766 -0.874275
O  5.793127 -2.549007 0.508861
O  -6.578714 -0.130363 1.486602
C  1.770873 -0.24268 -0.258983
C  0.899861 1.034008 -0.031821
C  -0.51764 0.937428 -0.629936
C  -1.241827 -0.291631 0.004345
C  3.101459 0.234071 0.463402
C  1.060576 -1.4269 0.430055
C  -2.753404 -0.451585 -0.45172
C  -0.410362 -1.60592 -0.037789
C  1.827464 2.199658 -0.447321
C  3.2448 1.741047 -0.010119
C  -1.307146 2.229633 -0.30382
C  2.063391 -0.528602 -1.7559
C  -3.469701 0.880033 -0.158866
C  -2.802782 2.136488 -0.686665
C  -3.396968 -1.604513 0.378748
C  -2.922964 -0.737238 -1.980105
C  4.332521 -0.60687 0.129368
C  -4.939195 -1.584035 0.385343
C  -4.681617 0.94739 0.480931
C  -5.479754 -0.236149 0.859377
C  4.685043 -1.782053 1.037203
H  0.769175 1.107097 1.070103
H  -0.458317 0.812339 -1.729642
H  -1.301372 -0.059941 1.094407
H  1.069785 -1.249317 1.522247
H  1.597665 -2.383651 0.254187
H  -0.88369 -2.333799 0.65497
H  1.793053 2.371497 -1.539002
H  1.577291 3.149753 0.052812
H  3.989933 1.804741 -0.821737
H  -0.84969 3.093923 -0.822249
H  -1.223767 2.426493 0.785449
H  2.622121 -1.476267 -1.869736
H  1.124312 -0.632767 -2.319939
H  2.678863 0.258969 -2.224283
H  -2.881764 2.135152 -1.794405
H  -3.347141 3.031604 -0.334191
H  -3.047052 -1.525584 1.429041
H  -3.041515 -2.575058 -0.013257
H  -2.472171 -1.707068 -2.235046
H  -3.995177 -0.742509 -2.249468
H  -2.42983 0.030355 -2.601518
H  3.206869 1.110094 2.232032
H  -5.353191 -2.379502 1.029741
H  -5.333916 -1.763704 -0.635563
H  0.162174 -2.943171 -1.446946
H  -5.146012 1.920017 0.691539
H  4.6613 2.748787 1.070558
H  3.795525 -2.431556 1.16106
H  4.923776 -1.385407 2.044444
H  6.117821 -2.068215 -0.305055
