program: Gaussian 09
title: 000101795
version: EM64L-G09RevD.01
frameworkgroup: C1[X(C17H16O4)]
method: RPBEPBE
basis: SDD
operation: Freq
keyword: #pfreq=noraman
keyword: PBEPBE/SDD
title: #p freq=noraman PBEPBE/SDD
converged: YES YES NO NO
title: Mulliken charges:
elementType: O O O O C C C C C C C C C C C C C C C C C H H H H H H H H H H H H H H H H
charge: -0.270502 -0.239334 -0.266793 -0.264405 -0.263366 -0.249707 0.250371 -0.366336 0.351909 0.225429 0.196131 -0.378882 -0.357001 -0.513281 -0.513652 -0.387080 0.353316 -0.392531 0.360030 -0.536724 -0.536373 0.243266 0.244480 0.224611 0.211505 0.230975 0.243297 0.260657 0.274490 0.248441 0.240747 0.223055 0.244068 0.220908 0.222263 0.220361 0.245656
chargesum: 0.00000
title: Mulliken charges with hydrogens summed into heavy atoms:
elementType: O O O O C C C C C C C C C C C C C C C C C
charge: -0.270502 -0.239334 -0.266793 -0.264405 -0.020099 -0.005227 0.250371 0.069780 0.351909 0.225429 0.196131 -0.147907 -0.113704 -0.252624 -0.239162 -0.138638 0.353316 -0.151783 0.360030 0.151307 0.151907
polarizability: 2.46681257e+02 -9.95422091e+00 1.89485217e+02 -9.55651511e+00 1.25773926e+01 1.56598330e+02
1716.lowfreq: -9.2816 -4.3172 -0.0004 0.0006 0.0008 8.8052 19.9582 41.4598 70.5100
frequency: 19.8321 41.4198 70.5052 75.2545 110.0220 124.7166 168.2137 175.3722 194.3742 213.2099 223.0907 237.2559 269.8187 276.0900 300.9404 317.8510 344.7595 376.8523 419.3129 437.9369 445.0498 462.8497 496.9668 514.9273 537.6439 553.7211 588.9259 613.7106 618.0074 649.9461 673.0984 707.5117 715.0862 718.8529 738.6534 753.9333 792.5735 804.6920 834.8702 842.2777 855.6928 868.7708 873.8735 910.2930 926.9455 936.4972 937.8279 966.8072 990.3593 1002.7706 1028.1353 1071.0506 1085.7646 1111.7747 1111.9380 1119.7893 1135.6811 1141.1929 1155.3629 1170.1656 1173.6951 1204.9433 1210.2372 1224.5857 1248.5445 1251.6297 1265.3668 1279.4051 1284.4195 1298.5896 1318.6569 1376.5602 1391.2723 1392.9326 1421.9985 1429.6966 1437.2842 1442.5873 1465.5809 1465.9526 1468.5087 1472.8370 1473.5044 1487.7430 1494.7384 1575.4337 1600.5412 1628.7876 1631.8510 2957.9103 2959.3801 2960.4173 2976.4598 3045.1444 3049.0086 3057.2851 3088.0612 3123.5150 3124.5736 3132.2713 3133.5735 3171.2437 3175.1457 3182.2904 3182.9821
redmass: 5.6926 4.0214 3.9339 3.8286 4.8485 3.9706 3.2527 3.8576 2.9585 1.3279 3.1464 1.4792 3.6841 3.8735 4.1439 4.2359 5.2109 4.7961 4.1277 3.1033 3.4801 5.7135 4.4665 4.8027 5.1781 5.4875 5.7156 4.3363 4.9772 4.5807 4.0389 4.9412 3.5743 5.5786 5.4421 3.3492 1.5395 1.4691 2.1526 3.6472 4.2220 1.6442 4.7481 4.3758 2.7377 1.4045 1.4185 3.4839 4.1031 3.2927 3.1217 2.3208 1.9919 1.2598 1.2584 2.2241 1.3923 1.4883 1.3993 1.5005 1.8474 1.3815 1.8923 1.6096 1.4292 1.9411 1.8537 1.7433 2.3103 1.8358 1.6859 1.3749 5.8724 6.1604 2.0896 2.6582 1.3097 1.7743 1.0501 1.0504 1.1345 1.1323 1.1021 2.4926 2.7280 8.0455 8.2111 7.9418 7.3443 1.0335 1.0777 1.0329 1.0732 1.1039 1.1040 1.0879 1.0965 1.0993 1.0994 1.0900 1.0893 1.0941 1.0946 1.0917 1.0924
irintensity: 0.5542 2.2934 4.6153 1.8439 3.3636 5.3219 0.2794 4.0716 3.2377 0.3030 1.6068 0.4003 4.0420 0.9942 1.7626 4.6635 0.0970 7.1230 9.7034 3.2008 0.6183 3.8586 20.0380 8.3266 15.7801 5.6066 5.9461 11.0294 3.4487 7.2780 1.6140 5.8106 8.4501 2.3372 2.6756 5.9175 58.3468 19.2833 26.9571 61.3365 0.1611 35.6683 26.5936 130.5284 11.1827 0.1060 1.2679 12.1362 44.9977 57.1801 27.0233 86.8158 53.7877 0.3831 0.2151 242.3958 33.2812 24.5257 4.4859 30.1478 122.8008 14.6717 40.0153 39.7561 40.1849 14.0682 45.2173 17.5509 21.2118 3.1371 22.1728 37.0266 21.6722 49.7346 5.0273 7.4058 5.5926 47.2828 12.1867 12.6560 14.2610 86.9684 55.9963 124.7625 84.8907 37.9101 81.6515 161.9091 212.1019 60.0940 6.8376 75.2092 106.2418 47.5620 47.5788 36.4803 23.3714 27.8066 26.7013 11.7066 6.1697 11.9641 6.5779 2.6005 0.2741
temp: 298.150 k
press: 1.00000 atm
elementType: 8 8 8 8 6 6 6 6 6 6 6 6 6 6 6 6 6 6 6 6 6 1 1 1 1 1 1 1 1 1 1 1 1 1 1 1 1
symmnumber: 1
zpe: 763205.3 jmol-1
zpe.correction: 0.290690 hartree
zpe.thermalcorrener: 0.308466 hartree
zpe.thermalcorrenthalpy: 0.309411 hartree
zpe.thermalcorrgfe: 0.244412 hartree
zpe.sumelectzpe: -956.755284 hartree
zpe.sumelectthermal: -956.737507 hartree
zpe.sumelectthermalent: -956.736563 hartree
zpe.sumelectthermalfe: -956.801561 hartree
dipole: -1.2462 0.7287 2.5413
dipole: 2.9227
quadrupole: -111.9231 -100.3768 -125.0092
quadrupole: -4.6169 -3.9056 1.4675
quadrupole: 0.5133 12.0596 -12.5728 -4.6169 -3.9056 1.4675
hfenergy: -957.0459731 hartree
pointgroup: C01 [X(C17H16O4)]
dipole: 0.4905604 -0.3097832 0.9927938 debye
polarizability: 246.8061793|-9.6984616|189.9793733|9.5997281|-11.6001395|155.9792515 unknown
InChI: InChI=1S/C17H16O4/c1-18-10-4-6-13-15(7-10)20-9-14-12-5-3-11(19-2)8-16(12)21-17(13)14/h3-8,14,17H,9H2,1-2H3
charge 0 multiplicity 1
37 atoms
O  -0.783595 -0.150882 1.832771
O  1.065286 1.898197 -1.106654
O  -4.638515 -1.700842 -0.874553
O  4.704143 -1.170407 -1.189377
C  -0.631299 2.048649 0.743191
C  0.175672 1.022404 1.605049
C  -1.722275 1.174116 0.134042
C  0.271334 2.798446 -0.248881
C  1.423776 0.509303 0.917026
C  -1.762404 -0.053202 0.825646
C  1.777969 0.910362 -0.402708
C  -2.660917 1.416835 -0.885279
C  2.226632 -0.472674 1.541145
C  -2.700848 -1.063294 0.555029
C  2.868723 0.33237 -1.078296
C  -3.621425 0.429021 -1.19532
C  -3.639233 -0.797084 -0.477541
C  3.329454 -1.063984 0.893825
C  3.639727 -0.658898 -0.432779
C  -4.694126 -2.992414 -0.187778
C  5.546526 -2.196352 -0.570152
H  -1.089604 2.812557 1.405396
H  0.386826 1.382422 2.62526
H  -0.322868 3.401285 -0.954377
H  0.969826 3.46514 0.298881
H  -2.654989 2.358612 -1.445956
H  1.957946 -0.803186 2.551257
H  -2.68329 -1.999901 1.116431
H  3.122528 0.653889 -2.091205
H  -4.361417 0.578595 -1.986182
H  3.92082 -1.824221 1.410788
H  -3.755912 -3.563793 -0.329147
H  -5.531061 -3.531388 -0.655722
H  -4.890589 -2.865887 0.895004
H  4.960147 -3.100995 -0.317395
H  6.047583 -1.812181 0.339666
H  6.300552 -2.44432 -1.331506
