program: Gaussian 09
title: 000101782
version: EM64L-G09RevD.01
frameworkgroup: C1[X(C12H20O6)]
method: RPBEPBE
basis: SDD
operation: Freq
keyword: #pfreq=noraman
keyword: PBEPBE/SDD
title: #p freq=noraman PBEPBE/SDD
converged: YES YES NO NO
title: Mulliken charges:
elementType: O O O O O O C C C C C C C C C C C C H H H H H H H H H H H H H H H H H H H H
charge: -0.225292 -0.298869 -0.247280 -0.286028 -0.284723 -0.449865 -0.102044 -0.182971 -0.157477 -0.100124 -0.064615 0.366478 -0.321725 0.358783 -0.682142 -0.688574 -0.685398 -0.698382 0.243775 0.245738 0.255077 0.252572 0.256741 0.183980 0.243778 0.349682 0.254682 0.221813 0.218780 0.218620 0.227005 0.234240 0.223895 0.231334 0.217258 0.221664 0.233353 0.216263
chargesum: 0.00000
title: Mulliken charges with hydrogens summed into heavy atoms:
elementType: O O O O O O C C C C C C C C C C C C
charge: -0.225292 -0.298869 -0.247280 -0.286028 -0.284723 -0.100183 0.141731 0.062767 0.097599 0.152449 0.192126 0.366478 0.106032 0.358783 0.013134 -0.008709 -0.012911 -0.027103
polarizability: 1.76281428e+02 -3.58075383e-01 1.41057120e+02 3.18145609e+00 1.71637411e+00 1.20264603e+02
1716.lowfreq: -12.5650 0.0003 0.0004 0.0007 2.0999 12.8606 27.7023 39.5952 55.7039
frequency: 27.6143 39.5708 55.6182 60.8492 81.2233 86.6760 106.6148 163.2399 164.9347 173.9809 206.3329 215.4896 221.5205 253.7535 283.7022 293.0465 302.2907 317.7061 326.9383 350.0314 355.8191 412.9857 417.3143 430.6343 466.1234 498.1104 513.7729 599.4516 613.3247 634.0804 660.5260 718.1457 725.4790 738.3976 746.0428 784.6161 823.4266 840.1385 856.8962 876.0841 897.2902 920.3886 921.7974 931.4137 935.7657 946.8178 978.2354 982.6308 983.6682 988.8187 1011.5181 1025.1853 1043.5959 1049.5114 1071.4879 1137.6806 1138.6876 1143.3076 1165.3395 1172.1163 1206.6976 1209.9889 1218.5260 1240.1166 1248.9665 1252.1648 1262.3713 1265.7154 1276.1839 1288.1002 1298.9781 1325.5846 1330.4254 1365.2160 1375.2725 1379.7681 1381.1909 1390.2517 1392.4360 1447.2299 1450.5452 1452.5218 1453.4993 1466.4415 1468.3639 1471.6072 1475.4487 1482.2746 2961.1630 2996.3421 2998.8317 3000.6613 3001.9253 3004.3443 3016.5179 3023.7647 3032.8575 3098.0446 3098.0968 3098.9035 3101.9688 3106.3206 3106.5516 3107.8827 3112.0784 3112.9279 3117.0282 3568.2304
redmass: 3.6221 4.0933 3.6223 4.3584 4.1229 4.6028 3.4279 2.2582 1.3178 1.0511 3.0796 1.1565 1.2226 3.0235 1.2803 3.1918 2.5117 3.5343 3.1399 3.1148 3.0582 3.1833 3.4446 3.6108 3.5855 4.3395 3.9938 5.3183 4.6396 5.2020 3.7619 5.4468 7.7190 3.9465 5.1785 4.8122 5.2381 4.4799 3.0886 3.3647 2.8548 1.5489 1.5260 2.9840 2.6595 2.6078 3.7744 1.4114 1.3961 4.0187 4.4860 3.9617 2.2701 2.6477 2.5647 1.9136 1.9227 1.7733 1.2820 1.2502 1.9247 2.6755 2.2621 2.7143 2.2777 1.6290 1.3762 1.2963 1.4079 1.3836 1.3760 1.1689 1.1983 1.5364 1.5181 1.3463 1.4302 1.2236 1.2217 1.0499 1.0497 1.0491 1.0493 1.0574 1.0638 1.0473 1.0538 1.0856 1.0690 1.0353 1.0784 1.0391 1.0355 1.0360 1.0863 1.0876 1.0858 1.0967 1.1001 1.1000 1.1004 1.0995 1.0897 1.0994 1.1008 1.1006 1.1004 1.0665
irintensity: 3.4177 0.4592 4.6281 1.1504 1.0374 1.7262 3.3419 1.0263 0.2322 0.0745 2.0459 0.5106 0.6079 2.4704 88.5396 17.6497 34.4729 7.5346 1.3402 10.1327 6.6008 7.0211 0.4255 5.2470 7.0865 22.9629 11.3339 10.7178 5.1384 5.7847 9.8907 19.1548 9.0243 59.7771 36.1617 10.5112 15.8673 31.7201 21.1826 27.1819 71.0205 6.7117 7.9719 125.9371 62.9868 72.2464 43.2294 6.4106 3.9263 121.3500 109.3598 67.0417 43.0032 11.0483 8.9849 104.9296 7.6058 16.3686 16.8652 23.8820 20.1973 153.3000 66.4804 56.8755 46.0650 4.6604 4.2762 4.0423 9.7351 1.3337 2.9712 2.6720 1.3372 6.0755 5.0831 61.7129 24.9900 26.2642 23.5650 1.1912 2.0152 3.5922 3.8117 5.2967 0.5718 18.9675 13.6970 1.7510 67.3557 12.8253 5.8345 6.0565 13.8550 15.5009 41.4812 18.6794 38.4240 14.0417 2.2479 2.0883 29.8765 34.5867 24.0533 26.7258 19.0414 31.4750 26.7347 10.7470
temp: 298.150 k
press: 1.00000 atm
elementType: 8 8 8 8 8 8 6 6 6 6 6 6 6 6 6 6 6 6 1 1 1 1 1 1 1 1 1 1 1 1 1 1 1 1 1 1 1 1
symmnumber: 1
zpe: 816021.2 jmol-1
zpe.correction: 0.310806 hartree
zpe.thermalcorrener: 0.329869 hartree
zpe.thermalcorrenthalpy: 0.330813 hartree
zpe.thermalcorrgfe: 0.263164 hartree
zpe.sumelectzpe: -919.139947 hartree
zpe.sumelectthermal: -919.120884 hartree
zpe.sumelectthermalent: -919.119940 hartree
zpe.sumelectthermalfe: -919.187589 hartree
dipole: -2.2265 2.1019 -1.9398
dipole: 3.6247
quadrupole: -105.7108 -96.9522 -111.6394
quadrupole: -6.0637 5.0272 2.4372
quadrupole: -0.9433 7.8153 -6.8719 -6.0637 5.0272 2.4372
hfenergy: -919.450753 hartree
pointgroup: C01 [X(C12H20O6)]
dipole: 0.8609314 -0.8915858 -0.7053409 debye
polarizability: 176.2944173|-1.432721|140.8473843|-2.6061947|-2.8182887|120.4613493 unknown
InChI: InChI=1S/C12H20O6/c1-11(2)14-5-6(16-11)8-7(13)9-10(15-8)18-12(3,4)17-9/h6-10,13H,5H2,1-4H3
charge 0 multiplicity 1
38 atoms
O  0.592777 0.120765 1.223908
O  2.83711 -0.450797 -0.940072
O  3.015239 0.536482 1.209125
O  -2.15356 0.91789 0.263035
O  -3.691906 -0.485793 -0.873457
O  0.060225 -2.700871 0.159093
C  -0.060347 -0.27074 -0.057189
C  2.113267 -1.314962 0.008046
C  0.679942 -1.548286 -0.512849
C  1.943766 -0.444041 1.283524
C  -1.555689 -0.437228 0.187173
C  3.401359 0.737588 -0.210606
C  -2.341297 -1.069554 -0.984612
C  -3.592226 0.764666 -0.046488
C  2.771484 2.013704 -0.776415
C  4.92684 0.702451 -0.290025
C  -4.417368 0.550159 1.229391
C  -4.020868 1.973086 -0.877063
H  0.091461 0.527633 -0.809753
H  2.674091 -2.252054 0.179763
H  0.672442 -1.666147 -1.61313
H  2.052356 -0.937592 2.259467
H  -1.717432 -0.993768 1.12816
H  -1.891911 -0.799717 -1.963364
H  -2.426425 -2.162923 -0.894757
H  0.51334 -3.531986 -0.130947
H  1.688445 2.034879 -0.576672
H  3.225954 2.897562 -0.296797
H  2.945818 2.070631 -1.864856
H  5.256158 0.838085 -1.334321
H  5.354312 1.511787 0.326428
H  5.303611 -0.264167 0.082273
H  -5.459746 0.301466 0.965279
H  -4.001178 -0.281586 1.82246
H  -4.411029 1.464582 1.847629
H  -3.871355 2.902876 -0.301204
H  -3.4212 2.024781 -1.800286
H  -5.087161 1.887841 -1.147093
