program: Gaussian 09
title: 000101819
version: EM64L-G09RevD.01
frameworkgroup: C1[X(C20H34O2)]
method: RPBEPBE
basis: SDD
operation: Freq
keyword: #pfreq=noraman
keyword: PBEPBE/SDD
title: #p freq=noraman PBEPBE/SDD
converged: YES YES NO NO
title: Mulliken charges:
elementType: O O C C C C C C C C C C C C C C C C C C C C H H H H H H H H H H H H H H H H H H H H H H H H H H H H H H H H H H
charge: -0.461602 -0.446243 -0.116713 -0.181251 -0.115358 0.415536 0.417379 -0.020390 0.205463 -0.547267 -0.540655 -0.507021 -0.556355 -0.498243 -0.480790 -0.531370 -0.513319 -0.819792 -0.870042 -0.470013 -0.058227 -0.812135 0.240264 0.184579 0.213777 0.183964 0.222750 0.211838 0.206320 0.220438 0.216804 0.196480 0.217126 0.225464 0.194487 0.210884 0.230918 0.197521 0.205374 0.213333 0.208534 0.218331 0.211526 0.225298 0.254751 0.221056 0.228010 0.224652 0.225399 0.180603 0.178849 0.226642 0.247152 0.208290 0.328445 0.328546
chargesum: 0.00000
title: Mulliken charges with hydrogens summed into heavy atoms:
elementType: O O C C C C C C C C C C C C C C C C C C C C
charge: -0.133156 -0.117696 0.123551 0.032526 0.069221 0.415536 0.417379 0.163574 0.205463 -0.112679 -0.113897 -0.093736 -0.113765 -0.092872 -0.052350 -0.112664 -0.086454 -0.128216 -0.196324 -0.064011 0.120622 -0.130051
polarizability: 2.61022996e+02 -3.05723745e+00 1.96736961e+02 1.60336690e+00 3.68187052e-01 1.74422786e+02
1716.lowfreq: -10.6320 -0.0010 -0.0006 0.0003 4.7797 12.2282 40.5450 60.8721 91.3664
frequency: 40.2860 60.8032 91.3149 103.9069 116.7783 139.1887 152.3175 179.7693 198.0724 204.6009 218.5312 242.7936 249.7587 259.5680 272.4040 282.4974 285.7387 291.7762 307.1088 310.7113 312.0840 330.7891 338.8537 369.2370 372.6721 390.1501 396.3649 423.3221 425.6787 453.3889 454.6817 471.2763 481.1332 518.2034 525.0585 546.3618 555.6890 563.7432 600.2475 646.4166 695.6092 722.6029 791.8329 797.9453 804.2594 831.2716 833.6228 845.4701 857.4314 892.6330 901.8897 912.7000 919.0287 930.9453 942.3468 952.4418 964.0145 979.4982 981.8645 990.8406 995.1922 1007.8302 1009.8132 1018.5894 1037.2188 1045.2700 1050.6938 1066.5192 1078.3720 1086.9725 1096.0562 1108.5431 1120.0696 1124.3505 1131.0568 1132.7636 1145.9459 1153.6343 1161.2152 1176.8512 1179.1196 1191.2289 1202.4499 1215.9582 1222.5911 1231.8572 1235.4238 1240.3270 1245.5927 1255.7505 1262.5944 1273.3001 1279.7236 1295.0679 1297.6472 1302.4857 1310.1822 1321.1367 1322.2904 1324.9669 1326.1010 1333.7561 1339.6506 1341.1358 1348.5407 1353.2086 1356.0550 1361.5363 1365.2078 1388.1218 1393.4316 1394.7851 1398.2104 1457.3448 1460.3216 1464.2214 1465.1433 1466.3769 1468.4064 1469.8223 1472.4529 1474.4255 1480.2163 1483.3538 1489.8125 1490.6349 1492.4416 1497.9360 2894.2940 2907.4031 2917.0935 2922.0265 2944.7067 2952.3278 2968.5728 2968.6830 2970.2399 2971.0186 2974.7558 2985.7623 2988.0715 2989.0322 2992.3935 2998.9428 3002.4265 3016.3610 3022.8534 3026.6630 3028.2091 3036.9929 3043.2959 3044.4379 3046.0924 3056.3980 3067.4448 3074.5822 3084.0365 3086.0357 3089.8417 3099.9633 3548.9349 3555.0540
redmass: 4.1085 3.2571 4.0254 2.1482 4.4459 1.7553 1.2893 1.7793 3.9756 2.6798 1.9473 2.2889 1.9636 1.7222 1.3166 2.2687 1.2378 1.9356 1.8975 1.9356 2.5197 2.4093 2.3000 2.4774 2.6791 3.3009 3.3372 2.8884 3.0539 2.0040 3.4531 3.2714 2.7721 2.5005 2.4903 2.7938 3.0814 2.7324 3.6985 2.7711 2.6882 2.6898 1.6265 1.8491 2.1349 2.3289 1.8786 2.3027 1.9800 1.5998 2.2772 1.7774 1.9179 1.8010 1.8469 1.7384 2.1235 2.4322 2.2495 2.1957 2.1938 1.9195 2.0245 2.0381 1.7211 1.7704 1.9042 1.7790 2.0770 2.0545 1.9030 1.8924 1.9495 1.8362 1.7053 2.0664 1.9109 1.8515 2.0512 1.7576 2.0690 2.0378 1.8455 1.5060 1.6371 1.5689 1.3664 1.5140 1.3719 1.5166 1.2910 1.5441 1.3456 1.4819 1.3277 1.3290 1.3973 1.3197 1.4164 1.4123 1.4160 1.3650 1.4909 1.4698 1.5721 1.5634 1.3729 1.4776 1.5067 1.2210 1.2270 1.3002 1.4774 1.0704 1.0815 1.0849 1.0859 1.0765 1.0741 1.0742 1.0569 1.0693 1.0769 1.0888 1.0804 1.0608 1.0653 1.0622 1.0811 1.0813 1.0828 1.0796 1.0647 1.0635 1.0616 1.0556 1.0618 1.0451 1.0785 1.0542 1.0580 1.0594 1.0456 1.0439 1.0589 1.0966 1.0978 1.1012 1.0979 1.0991 1.1012 1.1006 1.1015 1.0957 1.1036 1.0970 1.0975 1.0985 1.0992 1.0985 1.0659 1.0658
irintensity: 0.0298 0.9192 0.8929 0.3019 0.9693 0.4755 0.5507 0.1707 0.4087 1.3899 2.8234 1.6576 4.6401 11.3806 67.5526 8.7931 36.4974 36.5454 30.6345 42.7310 26.4348 10.9010 3.0117 0.4050 5.4298 4.8320 1.4702 0.1835 1.1120 2.2897 2.3615 5.0346 1.3809 1.9151 0.3789 0.4858 3.3047 4.3557 6.0519 5.8951 0.7409 4.4493 3.9115 1.4524 0.2860 6.0357 0.4120 16.4784 0.2738 11.5816 12.3215 17.3953 2.8318 13.6872 7.1172 7.4144 6.1888 10.4647 2.9436 15.6994 14.3685 11.3752 28.0225 14.9002 46.4507 25.5656 32.1082 8.5364 10.3724 13.6219 0.8894 3.9768 0.8986 17.2083 9.1665 8.3880 18.0138 3.4831 3.0088 21.2531 6.4681 2.3103 2.3776 5.1065 2.2081 4.9864 6.0728 3.9065 7.5097 3.7152 11.5984 2.0437 9.1868 9.9040 3.3886 2.8032 1.1615 1.3899 0.1911 4.8614 0.1100 0.4292 4.0208 5.0865 5.9298 0.3778 7.9495 6.5890 2.2399 37.3767 6.4731 25.1975 10.6542 2.0704 2.4711 8.3396 1.4619 8.5985 22.4738 5.3028 16.7375 0.7117 3.8645 9.3428 10.5639 3.3928 1.1291 15.0307 5.8330 8.8469 62.3045 23.1231 27.8267 36.5376 34.3223 10.0458 67.2715 46.1763 34.4044 10.7803 33.2542 38.9760 23.6977 41.9278 26.9402 47.2991 6.7979 43.7387 51.4625 50.7196 31.1763 7.8178 107.5971 48.4421 57.7274 28.5022 51.2567 30.0446 25.4997 18.3641 1.9257 2.3911
temp: 298.150 k
press: 1.00000 atm
elementType: 8 8 6 6 6 6 6 6 6 6 6 6 6 6 6 6 6 6 6 6 6 6 1 1 1 1 1 1 1 1 1 1 1 1 1 1 1 1 1 1 1 1 1 1 1 1 1 1 1 1 1 1 1 1 1 1
symmnumber: 1
zpe: 1320652.0 jmol-1
zpe.correction: 0.503010 hartree
zpe.thermalcorrener: 0.524831 hartree
zpe.thermalcorrenthalpy: 0.525775 hartree
zpe.thermalcorrgfe: 0.455760 hartree
zpe.sumelectzpe: -931.214008 hartree
zpe.sumelectthermal: -931.192186 hartree
zpe.sumelectthermalent: -931.191242 hartree
zpe.sumelectthermalfe: -931.261258 hartree
dipole: -1.4480 -0.4287 -2.1697
dipole: 2.6435
quadrupole: -142.2862 -137.3515 -135.5267
quadrupole: -14.0182 1.4730 2.3694
quadrupole: -3.8981 1.0366 2.8615 -14.0182 1.4730 2.3694
hfenergy: -931.7170176 hartree
pointgroup: C01 [X(C20H34O2)]
dipole: -0.5714186 -0.1598333 -0.8541576 debye
polarizability: 261.0195316|-3.1610165|196.7367656|1.4238266|0.5814745|174.426446 unknown
InChI: InChI=1S/C20H34O2/c1-18-9-6-14(21)12-13(18)4-5-15-16(18)7-10-19(2)17(15)8-11-20(19,3)22/h13-17,21-22H,4-12H2,1-3H3
charge 0 multiplicity 1
56 atoms
O  -5.056062 -1.061011 0.35611
O  6.179884 -0.035172 -0.377309
C  -0.43126 0.847098 0.307555
C  -1.875899 0.771864 -0.230198
C  0.354338 -0.415857 -0.187943
C  -2.641761 -0.508977 0.227483
C  1.867714 -0.402051 0.261515
C  2.500687 0.938725 -0.2668
C  -4.067321 -0.230805 -0.378785
C  -0.395312 -1.733366 0.165776
C  -1.876722 -1.744366 -0.305314
C  0.271362 2.153761 -0.134506
C  -2.855179 1.934062 0.08407
C  1.761241 2.184288 0.269549
C  -4.277218 1.304531 -0.104257
C  2.634795 -1.578488 -0.423025
C  4.02915 1.014482 -0.038434
C  -2.779199 -0.602315 1.773638
C  1.993077 -0.535787 1.804942
C  4.169076 -1.514529 -0.218704
C  4.744234 -0.169008 -0.702215
C  -4.201437 -0.561499 -1.880731
H  -0.469302 0.841026 1.41683
H  0.367914 -0.344986 -1.302998
H  -1.781413 0.713442 -1.338706
H  2.341737 0.929203 -1.37138
H  -0.35445 -1.906744 1.257836
H  0.123439 -2.591091 -0.303102
H  -1.888834 -1.742936 -1.413821
H  -2.369467 -2.67983 0.02488
H  -0.25917 3.026755 0.293039
H  0.195857 2.244955 -1.240153
H  -2.693238 2.802195 -0.579017
H  -2.714518 2.28923 1.122901
H  2.24308 3.099048 -0.130078
H  1.856125 2.237416 1.372794
H  -4.886202 1.418629 0.810733
H  -4.830052 1.785641 -0.933103
H  2.412101 -1.560163 -1.511869
H  2.265939 -2.548822 -0.041022
H  4.425384 1.958712 -0.458983
H  4.279546 1.019341 1.040091
H  -1.797626 -0.693002 2.268515
H  -3.289285 0.279181 2.198984
H  -3.385735 -1.484842 2.034665
H  1.679771 -1.54229 2.137352
H  3.032101 -0.389762 2.146572
H  1.368343 0.200294 2.339469
H  4.427301 -1.642092 0.850199
H  4.649657 -2.351873 -0.766843
H  4.605482 -0.101161 -1.806832
H  -3.460127 -0.020714 -2.495989
H  -4.079222 -1.644485 -2.053851
H  -5.205273 -0.266163 -2.245633
H  -5.944806 -0.921397 -0.059231
H  6.663756 -0.813791 -0.754666
