program: Gaussian 09
title: 000101826
version: EM64L-G09RevD.01
frameworkgroup: C1[X(C25H31NO3)]
method: RPBEPBE
basis: SDD
operation: Freq
keyword: #p
keyword: freq=noraman
keyword: PBEPBE/SDD
title: #p freq=noraman PBEPBE/SDD
converged: NO YES NO NO
title: Mulliken charges:
elementType: O O O N C C C C C C C C C C C C C C C C C C C C C C C C C H H H H H H H H H H H H H H H H H H H H H H H H H H H H H H H
charge: -0.295649 -0.235476 -0.249684 0.000072 -0.111133 0.380284 -0.164300 -0.095305 0.229439 -0.532933 -0.535651 -0.109901 -0.553995 -0.479855 -0.459108 0.539473 -0.813561 -0.640696 -0.492519 -0.810174 -0.563535 -0.585922 0.178568 0.203236 0.203183 -0.256301 -0.424917 -0.184645 -0.320852 0.212506 0.234465 0.202367 0.202010 0.222631 0.218716 0.228025 0.264197 0.216702 0.231010 0.227118 0.218013 0.227095 0.239657 0.230337 0.236472 0.221097 0.222179 0.236104 0.218539 0.215528 0.220757 0.228318 0.235008 0.245836 0.231180 0.255458 0.279345 0.274483 0.238517 0.248191
chargesum: 0.00000
title: Mulliken charges with hydrogens summed into heavy atoms:
elementType: O O O N C C C C C C C C C C C C C C C C C C C C C C C C C
charge: -0.295649 -0.235476 -0.249684 0.000072 0.101372 0.380284 0.070165 0.107062 0.229439 -0.108293 -0.088910 0.154296 -0.106283 -0.034725 0.007645 0.539473 -0.125655 -0.182413 -0.058452 -0.126092 -0.086520 -0.330464 0.178568 0.203236 0.203183 0.023044 -0.150434 0.053872 -0.072661
polarizability: 3.92327920e+02 1.04990381e+01 2.37499594e+02 -1.19093823e+01 -1.23565681e+01 2.13936505e+02
1716.lowfreq: -5.3576 -0.0008 -0.0004 0.0008 5.4989 10.6131 18.8874 22.1906 26.5343
frequency: 18.8570 22.0097 26.3503 44.4803 50.8805 58.0457 88.5157 115.8630 122.6460 143.6636 152.6892 166.1717 169.9838 183.8405 202.3255 211.6622 212.0913 230.1587 248.8018 259.6959 263.8234 278.0723 303.6521 310.8661 316.8896 360.2741 366.8464 376.2355 387.8909 399.0847 424.9415 427.9744 437.3418 450.1174 471.6916 492.9064 506.8935 528.0764 535.9439 553.1328 567.3958 593.0691 609.8140 622.7389 643.7548 672.3265 686.6799 696.6738 719.7021 726.2090 741.6624 774.3714 805.5260 806.3195 828.6597 832.9676 833.8780 843.9739 860.0011 882.9207 900.5378 913.4252 924.4867 937.0483 939.0409 953.3131 956.6676 963.1834 965.9711 971.7647 995.1200 999.3891 1003.7082 1006.5963 1022.0277 1022.7596 1028.8327 1032.5510 1042.4823 1049.0085 1074.6739 1076.9068 1078.6358 1093.3106 1106.3324 1114.9790 1116.4985 1125.0635 1129.5573 1135.2695 1160.3835 1177.7712 1187.7359 1189.3408 1195.8716 1204.4200 1211.9995 1212.6398 1230.9519 1239.1623 1246.8220 1251.2460 1260.6712 1271.1875 1278.9997 1280.1305 1286.6167 1291.3551 1304.0654 1311.2104 1320.1248 1321.5121 1325.4110 1326.5250 1332.6780 1335.4211 1343.4987 1346.9378 1349.6255 1353.7695 1356.5447 1373.0980 1389.0253 1394.4807 1408.2201 1443.8980 1454.6699 1457.0159 1459.2023 1463.5034 1466.9092 1469.4886 1472.3837 1479.5382 1482.1470 1484.9169 1490.6954 1491.9239 1550.6436 1584.8184 1585.0333 1612.6933 1624.0222 2907.2589 2915.4963 2951.8047 2960.6034 2961.6201 2971.4251 2975.0327 2980.1041 2984.9601 2989.7545 2994.3702 2996.5248 3014.0107 3021.3378 3026.8676 3035.0851 3040.0083 3041.9078 3048.9490 3055.9509 3062.3664 3076.1353 3082.9330 3085.8924 3087.9177 3090.8268 3117.5100 3135.4324 3154.3052 3162.9102 3174.4839
redmass: 5.9567 5.8953 5.0844 5.8144 3.3673 6.0646 3.8762 2.8714 5.3344 2.0019 5.6465 4.2237 1.9947 1.7029 1.5281 2.5570 2.0308 2.9488 3.6215 2.4340 2.8324 2.3608 3.0271 4.4687 3.2276 2.4177 3.1901 2.8265 2.7906 3.6489 3.9348 4.1479 5.4396 3.3219 3.0201 3.0372 3.5205 2.7111 2.6335 2.8554 4.0811 3.3717 6.2422 3.8275 3.6353 3.5998 4.1465 7.3139 1.8208 3.1017 2.5021 2.1491 2.9960 2.6272 2.0373 1.8362 2.1930 2.1167 2.2357 1.4814 1.8132 1.9491 1.8197 1.9700 1.3773 1.9792 2.8293 2.6407 1.4979 2.1940 2.4009 3.1902 1.9858 1.3810 3.6350 2.2294 1.9518 1.9343 2.2108 2.2070 2.4612 3.1531 2.7335 1.6554 1.6018 1.9504 2.7121 1.7761 1.6476 1.8648 2.2750 1.3813 1.8898 1.8032 1.3217 1.9470 1.1964 1.8045 1.4319 1.5995 1.4013 2.6695 1.5306 1.5356 1.9738 1.4461 1.4465 1.4226 1.4611 10.7868 1.5041 1.4541 1.3466 1.3034 1.3681 1.4006 2.1109 1.4924 1.4306 1.4016 1.4955 1.4287 1.2067 1.2185 2.1403 1.0784 2.1573 1.0874 1.0730 1.0850 1.0830 1.0885 1.0762 1.0780 1.0554 1.0578 1.0791 1.0653 5.9994 7.5944 7.3371 11.5433 7.7306 1.0811 1.0803 1.0664 1.0676 1.0705 1.0674 1.0648 1.0618 1.0419 1.0523 1.0528 1.0498 1.0856 1.0633 1.0962 1.0967 1.0980 1.0999 1.0999 1.1017 1.0958 1.0989 1.0991 1.0998 1.0992 1.1018 1.0911 1.0888 1.0913 1.0924 1.1003
irintensity: 0.5153 0.3846 0.7907 2.7658 0.4405 4.2509 0.2505 0.7774 0.2427 0.2924 2.6925 0.9863 0.6899 0.8298 0.1527 0.4731 0.9902 0.5841 5.2850 0.7539 2.2938 1.7771 2.3925 9.0153 2.3131 1.4993 4.4462 0.3725 0.0624 0.3025 0.3998 1.9584 3.0774 3.0325 0.2702 1.9065 2.7368 0.2838 1.1358 1.2988 0.2233 1.5376 2.1734 2.3318 0.1900 6.3392 6.3278 5.6962 55.0332 1.1862 0.6136 6.5894 1.2351 1.5019 3.7135 18.3635 7.8740 6.9622 12.1892 15.9564 3.9897 7.1398 3.9548 42.4293 0.6961 3.5052 18.2986 17.1702 1.3668 2.5341 3.1265 84.0541 6.1231 0.5842 25.3489 2.3140 5.9662 2.3156 37.3091 6.6883 71.3804 233.8786 52.0589 1.4344 8.9752 4.0510 0.8005 3.7597 4.3000 1.8845 0.9676 10.4723 25.4807 0.1179 5.7961 0.8188 7.9993 1.0776 37.8907 13.6346 0.4586 366.1168 50.4472 11.1509 36.9266 5.0225 3.2238 2.7805 2.1321 0.9804 2.7924 7.5185 3.3453 3.5768 0.5780 0.4770 7.0112 2.3779 1.4375 1.0549 3.8804 2.7671 11.4710 32.7870 30.3868 17.4889 11.6097 20.5904 2.6487 9.1804 9.6353 7.8068 8.4367 2.5843 6.1647 4.6060 14.1315 9.3777 0.0599 172.5736 28.7481 185.0782 203.6185 6.2099 18.8757 15.2419 20.7073 22.7134 38.0448 24.1442 27.6855 15.9085 14.0008 26.1459 37.8446 7.9555 29.3370 30.9259 44.9329 9.5087 80.2358 32.9620 18.0188 23.1863 43.5297 21.2052 41.2827 40.3570 20.5642 10.8964 11.3302 8.6566 9.6926 17.7184
temp: 298.150 k
press: 1.00000 atm
elementType: 8 8 8 7 6 6 6 6 6 6 6 6 6 6 6 6 6 6 6 6 6 6 6 6 6 6 6 6 6 1 1 1 1 1 1 1 1 1 1 1 1 1 1 1 1 1 1 1 1 1 1 1 1 1 1 1 1 1 1 1
symmnumber: 1
zpe: 1331419.2 jmol-1
zpe.correction: 0.507111 hartree
zpe.thermalcorrener: 0.533330 hartree
zpe.thermalcorrenthalpy: 0.534275 hartree
zpe.thermalcorrgfe: 0.450115 hartree
zpe.sumelectzpe: -1249.528676 hartree
zpe.sumelectthermal: -1249.502456 hartree
zpe.sumelectthermalent: -1249.501512 hartree
zpe.sumelectthermalfe: -1249.585672 hartree
dipole: -4.0397 1.0524 1.7516
dipole: 4.5271
quadrupole: -214.6224 -170.4843 -179.4692
quadrupole: 6.0785 23.4049 4.7454
quadrupole: -26.4304 17.7077 8.7227 6.0785 23.4049 4.7454
hfenergy: -1250.0357867 hartree
pointgroup: C01 [X(C25H31N1O3)]
dipole: -1.5908244 -0.3458234 -0.7224755 debye
polarizability: 392.3054718|-11.8637985|239.6084619|10.6727157|-10.0002046|211.8500853 unknown
InChI: InChI=1S/C25H31NO3/c1-24-11-9-18(27)14-17(24)5-6-19-20-7-8-22(25(20,2)12-10-21(19)24)29-23(28)16-4-3-13-26-15-16/h3-4,13-15,19-22H,5-12H2,1-2H3
charge 0 multiplicity 1
60 atoms
O  -3.092635 -0.269225 -0.005299
O  7.763279 0.75826 1.410463
O  -4.185799 -1.361465 1.746941
N  -6.452274 1.912359 -1.081107
C  0.448413 -1.390652 -0.116182
C  -0.601799 -0.239284 -0.235345
C  1.84444 -0.999319 -0.640689
C  2.350163 0.246534 0.159697
C  3.799624 0.726744 -0.26644
C  -0.108377 0.952602 0.616136
C  1.308629 1.404145 0.171229
C  -1.831321 -0.995042 0.326218
C  -0.276221 -2.630555 -0.70955
C  2.847284 -2.165363 -0.496189
C  -1.778669 -2.416688 -0.312506
C  4.74906 -0.486135 -0.254461
C  -0.87127 0.199855 -1.69901
C  4.267114 -1.747957 -0.946689
C  4.29007 1.794921 0.76219
C  3.811758 1.336153 -1.705506
C  5.808278 2.063316 0.713661
C  5.99811 -0.444867 0.312948
C  6.612271 0.774493 0.874724
C  -4.199835 -0.542169 0.793845
C  -5.392798 0.256407 0.382322
C  -6.603174 0.092206 1.102489
C  -5.368472 1.176129 -0.699737
C  -7.730457 0.845808 0.719172
C  -7.609394 1.739295 -0.372119
H  0.571332 -1.582747 0.976152
H  1.765934 -0.743111 -1.718674
H  2.451904 -0.102759 1.214564
H  -0.077226 0.648494 1.683673
H  -0.80944 1.806805 0.543403
H  1.241986 1.86232 -0.833638
H  1.650698 2.202729 0.854739
H  -1.779609 -1.065613 1.429585
H  0.124131 -3.57787 -0.308815
H  -0.158286 -2.665372 -1.809053
H  2.513083 -3.034876 -1.093546
H  2.876791 -2.491389 0.564135
H  -2.439248 -2.448287 -1.197598
H  -2.142855 -3.177649 0.397049
H  -1.21866 -0.638693 -2.327327
H  -1.658207 0.973668 -1.715954
H  0.029615 0.623055 -2.173424
H  4.242347 -1.5659 -2.042746
H  4.988582 -2.568538 -0.780276
H  4.027861 1.445388 1.781648
H  3.747904 2.744303 0.597574
H  3.420468 0.630982 -2.459501
H  3.200069 2.254599 -1.749933
H  4.840336 1.603877 -2.006613
H  6.119341 2.775927 1.497877
H  6.092907 2.517886 -0.257491
H  6.631184 -1.34206 0.326271
H  -6.632331 -0.614441 1.938247
H  -4.451234 1.324194 -1.276919
H  -8.683009 0.748931 1.248654
H  -8.462266 2.344141 -0.700771
