program: Gaussian 09
title: 000009161
version: EM64L-G09RevD.01
frameworkgroup: C1[X(C12H8)]
method: RPBEPBE
basis: SDD
operation: Freq
keyword: #p
keyword: freq=noraman
keyword: PBEPBE/SDD
title: #p freq=noraman PBEPBE/SDD
converged: NO NO NO NO
title: Mulliken charges:
elementType: C C C C C C C C C C C C H H H H H H H H
charge: -0.260298 0.389701 0.389707 0.499919 -0.409160 -0.409162 -0.419146 -0.419151 -0.423946 -0.423937 -0.216155 -0.216156 0.250814 0.250815 0.247257 0.247259 0.238606 0.238603 0.222214 0.222214
chargesum: 0.00000
title: Mulliken charges with hydrogens summed into heavy atoms:
elementType: C C C C C C C C C C C C
charge: -0.260298 0.389701 0.389707 0.499919 -0.158346 -0.158347 -0.171889 -0.171892 -0.185340 -0.185334 0.006060 0.006058
polarizability: 1.76248934e+02 -2.40558083e-04 1.52823332e+02 -1.31684224e-03 2.12980135e-04 4.83661962e+01
1716.lowfreq: -0.0007 -0.0005 0.0001 8.3192 11.8117 18.3951 167.5442 208.6405 226.8752
frequency: 167.5442 208.6405 226.8742 371.0293 410.7835 456.2140 456.6992 505.0268 547.4759 577.1897 614.9993 649.9056 672.6904 680.1933 753.3920 770.2807 785.7838 797.1831 856.1151 856.3070 914.4530 930.0988 930.3241 978.4927 986.2261 1010.1088 1020.1426 1039.2855 1087.2531 1097.8057 1171.8771 1193.3657 1205.5806 1236.3129 1253.5271 1314.2839 1367.1945 1407.6809 1409.0047 1464.7054 1469.8981 1485.5368 1486.3957 1597.4395 1622.8343 1630.2313 3121.5528 3121.9977 3134.3598 3134.6948 3154.3248 3155.5572 3173.8099 3201.1389
redmass: 4.0966 3.8077 3.7514 3.4330 4.4043 3.1659 4.0140 7.6370 6.6535 3.1941 3.1081 5.9470 2.7947 6.2567 1.6342 1.3115 1.4530 5.1127 4.6479 2.7547 1.3195 1.4697 1.4088 1.3666 1.3838 3.1394 2.7256 1.9642 1.1876 2.4616 1.2209 1.2650 1.5662 1.8052 2.1197 2.2744 3.2673 3.1450 1.8284 8.3001 4.0366 4.2194 3.8133 7.0416 7.7832 7.5924 1.0862 1.0860 1.0925 1.0920 1.0985 1.0979 1.0884 1.1050
irintensity: 9.3308 0.0000 6.8126 0.0000 1.9537 0.0514 1.4304 1.3396 2.9490 0.0000 0.3660 0.4249 0.0000 0.0514 76.9414 0.0000 31.5953 0.0651 5.1370 98.1676 0.0000 2.1050 0.0000 0.0000 3.9888 0.0171 2.3686 2.5866 18.6466 1.3507 2.0520 6.9219 1.9439 12.1499 2.5466 1.1859 0.0045 3.0716 4.9734 32.5824 12.2531 15.9513 19.8429 0.4562 3.1980 2.3845 0.5330 0.0059 2.8343 30.8004 63.2316 13.6495 1.0694 19.3416
temp: 298.150 k
press: 1.00000 atm
elementType: 6 6 6 6 6 6 6 6 6 6 6 6 1 1 1 1 1 1 1 1
symmnumber: 1
zpe: 411945.0 jmol-1
zpe.correction: 0.156902 hartree
zpe.thermalcorrener: 0.164678 hartree
zpe.thermalcorrenthalpy: 0.165622 hartree
zpe.thermalcorrgfe: 0.124448 hartree
zpe.sumelectzpe: -461.281031 hartree
zpe.sumelectthermal: -461.273255 hartree
zpe.sumelectthermalent: -461.272311 hartree
zpe.sumelectthermalfe: -461.313485 hartree
dipole: 0.0000 -0.5362 0.0000
dipole: 0.5362
quadrupole: -57.3417 -59.6430 -75.6232
quadrupole: -0.0001 0.0000 0.0000
quadrupole: 6.8610 4.5596 -11.4206 -0.0001 0.0000 0.0000
hfenergy: -461.4379327 hartree
pointgroup: C01 [X(C12H8)]
dipole: -0.0000125 0.210959 -0.0000052 debye
dipolederiv: 0.1361546 -0.0000089 0.0000029 -0.0000111 -0.4977022 -0.000001 -0.000008 -0.0000031 -0.094932 -0.1075648 -0.1724489 0.000001 0.2196429 -0.114034 0.0000011 0.000003 -0.0000075 0.0494408 -0.1075797 0.1724723 0.0000019 -0.2196021 -0.114042 0.0000013 -0.0000002 0.0000049 0.0494441 -0.1857028 0.0000044 -0.0000019 0.0000006 0.0688385 -0.0000007 0.0000008 -0.0000008 0.0903538 -0.0566758 0.2617569 -0.0000067 -0.0186377 0.2343618 0.0000101 -0.0000052 0.0000228 -0.2122064 -0.0566539 -0.2617604 -0.0000073 0.0186181 0.2343489 -0.0000081 -0.0000027 -0.0000195 -0.2122094 0.0494133 0.006595 -0.0000007 -0.2366295 0.2139596 0.0000028 -0.0000007 0.0000048 -0.1498901 0.0494137 -0.0065978 -0.0000034 0.2366179 0.213966 -0.0000009 -0.000007 0.0000015 -0.1498888 0.2029167 -0.1201486 0.0000061 0.0408875 0.1172048 -0.0000023 0.0000022 -0.0000101 -0.1776539 0.2029278 0.1201481 0.0000016 -0.0408846 0.1172169 0.0000023 0.000003 0.0000178 -0.1776515 -0.0144916 0.2116794 0.0000017 0.2761433 -0.146895 0.000005 0.0000006 0.0000064 -0.1609157 -0.0145024 -0.2116862 0.0000069 -0.2761482 -0.1468842 -0.0000064 0.0000122 -0.0000079 -0.1609158 0.0367198 0.1079478 0.0000042 0.0555017 -0.0489329 -0.000005 0.0000039 -0.0000076 0.1802802 0.0367146 -0.1079494 0.0000031 -0.0555022 -0.048923 0.0000033 0.0000032 0.0000056 0.1802809 -0.0606282 0.0805169 -0.0000005 0.100357 0.0331865 -0.0000015 -0.0000008 -0.0000031 0.1564715 -0.0606262 -0.0805115 -0.0000004 -0.1003488 0.0331927 -0.0000004 0.0000069 0.0000007 0.1564725 0.078284 0.0106008 -0.0000016 -0.0446468 -0.1092827 -0.0000002 -0.0000016 0.0000037 0.1582497 0.0782856 -0.0106148 -0.0000006 0.0446422 -0.1092899 0.0000005 0.0000013 -0.0000111 0.1582477 -0.1032038 -0.0997076 -0.0000031 -0.0998293 0.034857 -0.0000021 0.0000004 -0.0000015 0.1585111 -0.1032008 0.0997124 -0.0000032 0.0998289 0.0348534 0.0000022 -0.0000112 0.0000038 0.1585114 unknown
polarizability: 176.2489339|-0.0000078|152.8233325|0.0013168|0.000213|48.3661962 unknown
InChI: InChI=1S/C12H8/c1-3-9-4-2-6-11-8-7-10(5-1)12(9)11/h1-8H
charge 0 multiplicity 1
20 atoms
C  0.000004 -0.13739 0.000013
C  1.171415 -0.955004 0.000007
C  -1.171434 -0.954961 0.000009
C  0.000033 1.277192 0.000017
C  0.695338 -2.361769 -0.000001
C  -0.695402 -2.361749 0.000006
C  2.420556 -0.318653 0.00003
C  -2.420556 -0.318594 -0.000015
C  1.293381 1.908666 0.000041
C  -1.293325 1.908701 -0.000023
C  2.458737 1.120366 0.000054
C  -2.458695 1.120445 -0.000005
H  1.343458 -3.240925 -0.000031
H  -1.343557 -3.240877 0.000028
H  3.357946 -0.886889 0.000028
H  -3.357964 -0.886796 -0.000018
H  1.376452 3.002379 0.000036
H  -1.376334 3.002421 -0.000023
H  3.433601 1.621572 0.000065
H  -3.433553 1.621665 -0.000018
