program: Gaussian 09
title: 000101903
version: EM64L-G09RevD.01
frameworkgroup: C1[X(C19H22N6O4)]
method: RPBEPBE
basis: SDD
operation: Freq
keyword: #p
keyword: freq=noraman
keyword: PBEPBE/SDD
title: #p freq=noraman PBEPBE/SDD
converged: YES YES NO NO
title: Mulliken charges:
elementType: O O O O N N N N N N C C C C C C C C C C C C C C C C C C C H H H H H H H H H H H H H H H H H H H H H H
charge: -0.277948 -0.274432 -0.205071 -0.209162 -0.402377 -0.467487 -0.234954 0.026177 -0.659453 -0.643067 -0.023310 -0.448535 -0.425203 -0.445984 0.186292 0.086943 0.285600 0.256642 -0.325911 -0.331503 -0.358029 -0.408491 -0.360354 -0.370121 0.314059 0.388538 -0.225074 -0.254871 -0.233562 0.305585 0.218512 0.262765 0.207433 0.215925 0.323726 0.411455 0.204549 0.213203 0.286831 0.231164 0.277907 0.283715 0.288230 0.285997 0.231741 0.232540 0.232235 0.316000 0.349554 0.301155 0.360427
chargesum: 0.00000
title: Mulliken charges with hydrogens summed into heavy atoms:
elementType: O O O O N N N N N N C C C C C C C C C C C C C C C C C C C
charge: -0.277948 -0.274432 -0.205071 -0.209162 -0.078651 -0.056032 -0.234954 0.026177 0.006101 0.018516 0.282275 0.032742 -0.001845 -0.028232 0.186292 0.086943 0.285600 0.256642 -0.039081 -0.100340 -0.080122 -0.124776 -0.072125 -0.084124 0.314059 0.388538 0.006667 -0.022331 -0.001327
polarizability: 3.67727301e+02 -6.22076078e+00 2.40801401e+02 1.68585186e+01 -8.61171289e+00 2.25906323e+02
1716.lowfreq: -7.3854 -2.2600 -0.0009 -0.0006 0.0005 2.4277 13.2929 14.0857 19.9431
frequency: 12.9609 14.0221 19.9258 33.7837 41.3065 47.1257 58.8424 63.2102 70.5081 80.8288 86.0826 98.2030 111.6356 135.2310 157.4297 179.0142 185.9879 203.8443 217.8510 238.4206 240.6947 268.1429 277.3785 285.7655 297.7092 312.3634 355.2288 393.7389 407.0093 408.3798 421.8104 434.1896 437.2151 443.1114 455.2169 466.0230 494.0293 498.9459 510.5504 524.0200 533.3309 546.8316 567.4303 614.1710 623.8417 631.2214 658.7086 660.8552 676.6040 682.1916 690.3677 691.8568 712.5171 764.4568 781.5952 789.2880 795.8609 826.0949 844.3220 847.9817 860.5222 868.9619 881.8090 885.1795 944.9821 955.4252 968.2443 985.0370 985.6636 990.6260 991.8919 1004.0710 1004.7535 1010.3712 1011.7670 1025.8323 1036.9882 1049.4944 1077.3435 1082.1109 1091.3714 1095.3225 1103.0559 1111.9735 1133.3023 1161.2249 1172.3099 1178.6438 1180.0041 1188.4877 1190.6260 1219.5488 1230.4706 1253.6988 1267.9829 1294.7145 1298.4316 1316.3302 1320.8372 1340.1819 1345.8357 1359.1050 1362.5891 1366.4076 1381.8747 1402.1311 1409.1594 1432.0331 1447.0181 1451.2436 1460.2269 1464.9743 1468.7497 1479.2213 1483.5754 1551.3256 1568.3036 1586.2790 1601.3849 1604.6082 1608.4988 1608.8191 1618.1441 1637.1355 1665.4574 2719.3621 2887.0673 2934.2645 2992.4380 2996.5498 3007.8319 3044.6632 3072.3639 3123.7144 3134.0487 3141.3985 3144.9020 3156.2283 3165.3225 3168.0869 3184.0965 3187.6663 3521.8106 3547.2156 3560.1975 3667.6570 3701.2496
redmass: 6.2819 5.3211 6.7921 4.4922 4.9706 7.2607 5.7442 6.3042 6.2764 4.4645 6.3522 4.7226 6.5964 4.0759 5.0215 5.4501 5.3321 4.2576 3.5301 3.2212 3.9271 7.2784 2.6123 6.9710 2.1788 1.9301 4.1063 5.7815 2.8726 2.8752 1.3801 1.3839 4.0445 1.5595 3.8089 4.8982 4.6261 3.1837 2.3212 2.5934 2.3008 1.2501 2.5262 6.4131 6.6491 4.0141 6.0082 5.3493 7.3912 6.6137 4.2066 5.1182 1.5670 4.6878 8.7195 3.1679 2.3840 2.9525 2.7753 1.3955 4.3220 1.2692 1.8562 2.1305 1.4396 2.5462 2.9444 1.7274 1.6936 1.5197 2.0402 2.5467 1.3402 1.5353 2.0115 2.2305 1.6350 2.1546 2.3006 1.6110 3.3652 2.0243 1.8680 1.6093 2.8580 2.8279 1.0625 2.3822 1.3415 1.1363 1.2143 5.6763 1.2339 1.6352 1.1567 1.3363 1.6959 3.4144 1.4055 1.3400 1.3837 1.3642 5.5627 1.3993 9.1709 11.3347 3.8997 2.2286 3.7828 2.0888 1.0893 1.1005 1.1030 2.2406 2.4739 6.0841 8.6880 3.2964 6.2696 2.8391 5.9253 6.6605 1.2102 1.2451 2.1957 1.1075 1.0570 1.1002 1.0635 1.0711 1.0765 1.1016 1.0981 1.0852 1.0883 1.0899 1.0932 1.0959 1.0897 1.1003 1.0946 1.0963 1.0469 1.0778 1.0459 1.1024 1.1034
irintensity: 1.3538 0.1555 0.1859 0.1005 0.3202 1.1705 1.0218 1.6124 2.0296 6.6261 4.4804 2.0883 2.1417 1.1631 2.5756 13.3045 1.4240 5.6172 7.2873 9.5011 12.5015 2.4250 9.1592 29.9785 27.0524 16.8180 1.9199 1.4572 0.3356 0.1829 196.2389 38.2258 19.1969 66.9724 4.0575 3.8520 2.9513 3.6840 28.4161 22.4828 24.1440 218.0077 30.5278 0.4821 0.9988 12.1578 2.4949 5.2799 26.3650 14.1197 43.3048 2.7489 86.2413 3.8810 50.7851 9.3665 10.4553 8.0659 20.9783 7.3831 3.1639 6.2510 49.7876 2.3535 3.5811 3.7838 10.8594 12.9310 10.3640 17.1037 10.8863 8.6912 1.8207 1.8710 33.7767 10.9528 1.0428 29.4160 1.9649 15.8954 14.9241 41.4276 9.6598 16.4964 60.0993 7.6618 1.0990 6.7310 31.7741 6.2360 12.3868 431.4558 3.6619 30.9707 2.0404 3.1189 21.6277 340.6427 39.9475 4.5646 8.3974 64.2059 81.9134 2.3508 1.9924 3.8062 35.0679 1.8211 120.7728 312.4400 51.1484 20.4870 30.4823 6.5433 121.9019 348.7894 140.3452 128.8856 46.2626 50.9220 5.1756 18.2637 182.5715 99.2385 492.7943 1521.8811 55.4015 39.9694 31.8357 12.5090 23.2868 46.0155 20.8975 1.2538 5.4359 11.7201 16.7883 15.0451 1.3499 23.8475 1.1326 0.9498 112.6727 25.5082 33.5690 74.3900 28.5290
temp: 298.150 k
press: 1.00000 atm
elementType: 8 8 8 8 7 7 7 7 7 7 6 6 6 6 6 6 6 6 6 6 6 6 6 6 6 6 6 6 6 1 1 1 1 1 1 1 1 1 1 1 1 1 1 1 1 1 1 1 1 1 1
symmnumber: 1
zpe: 1047444.8 jmol-1
zpe.correction: 0.398951 hartree
zpe.thermalcorrener: 0.426679 hartree
zpe.thermalcorrenthalpy: 0.427624 hartree
zpe.thermalcorrgfe: 0.336449 hartree
zpe.sumelectzpe: -1364.480282 hartree
zpe.sumelectthermal: -1364.452553 hartree
zpe.sumelectthermalent: -1364.451609 hartree
zpe.sumelectthermalfe: -1364.542784 hartree
dipole: -13.2254 -3.7543 -4.4459
dipole: 14.4490
quadrupole: -167.7351 -157.1406 -177.9889
quadrupole: 3.5897 20.9820 7.9952
quadrupole: -0.1136 10.4809 -10.3673 3.5897 20.9820 7.9952
hfenergy: -1364.8792328 hartree
pointgroup: C01 [X(C19H22N6O4)]
dipole: -4.7429209 2.6113801 1.7322854 debye
polarizability: 362.9180681|-19.4624409|240.7765006|-25.2693667|-6.2380681|230.7404564 unknown
InChI: InChI=1S/C19H22N6O4/c20-19(21)22-12-4-7-16(23-17(26)13-5-2-1-3-6-13)24-18(27)14-8-10-15(11-9-14)25(28)29/h1-3,5-6,8-11,16,23-24H,4,7,12,20-21H2
charge 0 multiplicity 1
51 atoms
O  2.106613 1.143007 -2.451173
O  -1.313152 -1.697428 -1.60872
O  7.757262 -2.121698 0.120556
O  6.80005 -2.145249 2.190707
N  0.821414 0.44207 -0.646595
N  -1.567634 0.337152 -0.492862
N  -2.946058 2.447808 0.643655
N  6.777034 -1.882142 0.925915
N  -4.763725 3.987434 1.023619
N  -5.188181 1.722486 0.592517
C  -0.459113 0.937938 -1.235879
C  -0.528449 2.482907 -1.205487
C  -0.573122 3.109769 0.215182
C  -1.980755 3.572349 0.655225
C  2.012425 0.538348 -1.332656
C  -1.921508 -0.977833 -0.747696
C  3.2221 -0.105606 -0.691706
C  -3.063388 -1.543109 0.064307
C  4.331848 -0.377743 -1.532887
C  3.304617 -0.41004 0.693113
C  -3.726702 -2.688873 -0.446098
C  -3.444821 -1.024343 1.330337
C  5.500008 -0.964188 -1.014664
C  4.467708 -0.992855 1.230834
C  -4.235631 2.722045 0.757586
C  5.548293 -1.266582 0.364583
C  -4.770527 -3.29466 0.283094
C  -4.483432 -1.642086 2.066438
C  -5.152242 -2.773269 1.543401
H  -0.472548 0.593427 -2.288613
H  -1.420586 2.790452 -1.785054
H  0.354949 2.839869 -1.761776
H  0.091436 3.993844 0.252797
H  -0.173227 2.391085 0.956677
H  0.727775 -0.202317 0.140715
H  -2.191271 1.022849 0.04181
H  -2.307849 4.390872 -0.029761
H  -1.897524 4.014006 1.675129
H  4.250449 -0.109794 -2.59064
H  2.477491 -0.167328 1.369169
H  -3.390578 -3.091256 -1.407425
H  -2.917461 -0.161455 1.752653
H  6.363575 -1.188887 -1.645719
H  4.557096 -1.232215 2.293443
H  -5.279724 -4.176229 -0.121719
H  -4.758374 -1.248777 3.051763
H  -5.953534 -3.252314 2.117323
H  -5.73826 4.200958 0.826271
H  -4.139836 4.759338 1.238319
H  -6.106001 1.810667 1.023148
H  -4.854734 0.781294 0.384645
