program: Gaussian 09
title: 000101750
version: EM64L-G09RevD.01
frameworkgroup: C1[X(C20H32)]
method: RPBEPBE
basis: SDD
operation: Freq
keyword: #p
keyword: freq=noraman
keyword: PBEPBE/SDD
title: #p freq=noraman PBEPBE/SDD
converged: YES YES NO NO
title: Mulliken charges:
elementType: C C C C C C C C C C C C C C C C C C C C H H H H H H H H H H H H H H H H H H H H H H H H H H H H H H H H
charge: -0.187073 -0.486910 -0.480066 -0.551229 0.530154 0.622756 -0.427624 -0.599227 -0.614812 -0.459694 -0.451030 -0.797237 -0.268772 -0.307716 0.378019 0.382051 -0.795891 -0.796837 -0.787086 -0.800364 0.204315 0.212021 0.210422 0.220441 0.214825 0.223879 0.214251 0.208036 0.210160 0.203571 0.213884 0.217138 0.207055 0.208570 0.215703 0.205751 0.213819 0.219258 0.204521 0.216125 0.222364 0.215401 0.223838 0.225555 0.228230 0.214321 0.215449 0.228441 0.214445 0.229150 0.216543 0.221108
chargesum: 0.00000
title: Mulliken charges with hydrogens summed into heavy atoms:
elementType: C C C C C C C C C C C C C C C C C C C C
charge: 0.017241 -0.064466 -0.044801 -0.113100 0.530154 0.622756 -0.219589 -0.185496 -0.183789 -0.044069 -0.029575 -0.364160 -0.064252 -0.091590 0.378019 0.382051 -0.134288 -0.128732 -0.128751 -0.133563
polarizability: 2.30421309e+02 -8.15363453e+00 2.43679867e+02 -1.53658021e+00 8.67553044e+00 1.71824069e+02
1716.lowfreq: -0.0002 -0.0002 -0.0001 6.2048 7.5658 11.5964 15.9085 21.9955 26.4987
frequency: 15.5112 21.4595 25.9071 30.2102 31.8085 44.8952 67.6211 87.1621 96.1125 117.5819 125.7241 130.0684 151.3973 163.4542 181.4882 192.1113 207.3133 215.3946 268.3463 281.6157 290.6103 299.3509 319.8700 335.6502 340.6414 374.8350 392.9241 410.5777 431.7448 448.8647 456.9033 476.9849 497.1091 519.5887 531.7412 550.2979 625.3116 638.7959 706.3344 741.5629 751.2865 776.6894 794.0420 802.3899 815.6813 830.3311 839.5547 891.3007 907.3587 915.9859 925.6603 926.3535 938.1210 947.0119 947.6872 964.2701 984.7931 989.1210 993.8297 995.4583 1008.2801 1009.9563 1033.4429 1037.4381 1058.0368 1071.2176 1081.1106 1082.2962 1097.8129 1111.4281 1122.0251 1131.7762 1146.0561 1150.9697 1173.7149 1193.8373 1209.6974 1225.3606 1231.7290 1235.0900 1252.0806 1258.0970 1277.2049 1294.5305 1297.7344 1311.3023 1317.3122 1320.0040 1329.2572 1334.4776 1356.6139 1362.0041 1366.1756 1371.4964 1387.1413 1388.1681 1397.6381 1398.2656 1431.0299 1453.4456 1454.6457 1456.0595 1457.1655 1458.5689 1460.1043 1461.9145 1466.1580 1468.2560 1469.2073 1471.6676 1473.2151 1474.7744 1476.5273 1483.6236 1658.3018 1687.4988 1692.6230 1695.7830 2945.2212 2948.0772 2952.1936 2953.5591 2955.8333 2960.4190 2960.5448 2961.1874 2963.8583 2965.3232 2979.1777 2979.4238 2994.5946 3005.2456 3015.7133 3021.8041 3025.2130 3026.2945 3027.1650 3029.2609 3041.5608 3044.4605 3048.8803 3068.2903 3071.5234 3078.5897 3079.2594 3083.4660 3087.3506 3089.2687 3089.8596 3180.9519
redmass: 3.6026 3.7810 2.8540 3.0732 3.2464 2.9285 3.3430 2.7872 2.5906 1.1009 1.2821 2.1182 2.4445 2.5959 2.1896 1.1580 1.3269 2.3463 2.6798 2.8150 2.2080 2.5254 2.5268 2.4611 2.2102 2.1845 2.3356 2.4627 2.5338 2.3097 2.3192 2.3724 2.8636 2.7005 2.8617 2.7647 3.1841 3.5837 1.0856 2.7982 1.7419 2.2396 1.6423 1.3358 1.6475 1.4569 1.4437 2.0703 2.6570 1.5331 1.6061 1.6399 2.0581 1.4269 1.4022 2.3058 1.9054 1.9951 1.2682 1.3550 3.3877 2.2700 1.8054 1.8374 2.3071 1.9001 1.6611 1.6646 1.5476 1.5513 2.7638 1.1740 1.7289 2.0232 1.4976 1.2397 1.4083 1.8278 1.7953 1.6172 1.5216 1.4195 1.1732 1.3888 1.3229 1.5138 1.3731 1.3487 1.3368 1.4222 1.4544 1.4435 1.8058 1.7456 1.3095 1.3140 1.2256 1.2316 1.1585 1.0919 1.0550 1.0683 1.0623 1.0727 1.0823 1.0828 1.0887 1.0829 1.0605 1.0623 1.0748 1.0534 1.0814 1.0898 4.8751 6.9637 6.4416 6.5553 1.0604 1.0618 1.0380 1.0688 1.0374 1.0396 1.0659 1.0452 1.0616 1.0656 1.0742 1.0629 1.0851 1.0978 1.0970 1.0966 1.0962 1.0970 1.0964 1.0963 1.0935 1.1027 1.0988 1.0911 1.0938 1.0963 1.0957 1.0623 1.0906 1.0955 1.0957 1.1134
irintensity: 0.0244 0.0188 0.0503 0.0779 0.0237 0.0185 0.2392 0.1361 0.4985 0.6423 0.1454 0.0032 0.7673 0.7784 0.2701 0.7631 0.5080 0.7333 0.7210 1.2436 0.2221 0.2344 2.0331 1.6809 0.3834 0.2957 1.6915 2.5564 5.2931 6.9060 2.6649 0.6175 2.9900 1.1260 3.8369 6.9652 2.4732 7.2651 0.5781 0.8016 4.2424 6.3682 4.6390 3.9985 7.8159 22.3976 19.7612 3.2921 0.7583 8.0489 30.0040 35.0440 1.7084 0.2852 1.2208 3.5752 2.7286 2.7600 5.4015 1.5602 0.6135 1.9561 4.1983 8.2621 4.0507 0.7461 3.6218 3.0372 5.7594 13.4240 7.5278 4.7670 2.3200 3.8969 2.2152 0.6557 1.8719 2.6798 2.8625 6.1845 1.5804 7.6462 3.0372 2.4380 1.2300 6.9257 1.8324 2.5672 1.1164 0.2897 3.1225 0.6803 9.5211 1.0063 30.8039 25.5040 10.0595 5.5775 6.7287 4.7256 2.0642 5.8633 12.7425 7.4633 2.9141 4.7315 5.4417 17.7063 12.4048 9.4907 9.7704 33.1271 5.8629 15.1537 33.5773 1.6149 2.6154 2.9345 42.3751 21.1372 33.1316 21.9278 41.5307 50.0120 54.9080 27.7562 23.3782 83.2983 19.8015 39.4686 45.7705 44.6416 12.3314 18.7680 5.4247 0.9622 56.1073 52.5877 23.7132 45.9186 36.1500 15.2782 17.8985 43.2562 67.6563 9.9822 43.6214 44.9647 41.7367 31.1306
temp: 298.150 k
press: 1.00000 atm
elementType: 6 6 6 6 6 6 6 6 6 6 6 6 6 6 6 6 6 6 6 6 1 1 1 1 1 1 1 1 1 1 1 1 1 1 1 1 1 1 1 1 1 1 1 1 1 1 1 1 1 1 1 1
symmnumber: 1
zpe: 1214190.1 jmol-1
zpe.correction: 0.462461 hartree
zpe.thermalcorrener: 0.486572 hartree
zpe.thermalcorrenthalpy: 0.487516 hartree
zpe.thermalcorrgfe: 0.405514 hartree
zpe.sumelectzpe: -779.690368 hartree
zpe.sumelectthermal: -779.666257 hartree
zpe.sumelectthermalent: -779.665313 hartree
zpe.sumelectthermalfe: -779.747315 hartree
dipole: 0.1549 1.1710 0.4624
dipole: 1.2685
quadrupole: -122.9147 -125.1798 -125.4684
quadrupole: -2.5661 0.1740 1.0833
quadrupole: 1.6063 -0.6589 -0.9474 -2.5661 0.1740 1.0833
hfenergy: -780.1528286 hartree
pointgroup: C01 [X(C20H32)]
dipole: 0.0553882 -0.4554305 -0.1963775 debye
polarizability: 230.4179604|8.444082|243.2124137|-0.3673916|10.3070615|172.2948712 unknown
InChI: InChI=1S/C20H32/c1-16(2)8-6-10-18(5)20-14-12-19(13-15-20)11-7-9-17(3)4/h8-9,12,20H,5-7,10-11,13-15H2,1-4H3
charge 0 multiplicity 1
52 atoms
C  -0.181714 1.815781 -0.111293
C  0.829936 2.262353 -1.204272
C  0.458504 2.050332 1.28509
C  2.105937 1.392222 -1.148999
C  2.630683 1.189149 0.267951
C  -1.555101 2.480859 -0.261335
C  1.877527 1.514367 1.355576
C  4.021894 0.59121 0.40849
C  -2.725758 1.545402 -0.534825
C  4.173064 -0.817433 -0.254509
C  -3.057128 0.620111 0.682436
C  -1.725656 3.8273 -0.165383
C  3.224913 -1.842804 0.33352
C  -4.175202 -0.355756 0.378829
C  2.384562 -2.696487 -0.32004
C  -4.087139 -1.709167 0.220577
C  2.248522 -2.793566 -1.830411
C  1.491726 -3.654508 0.454839
C  -5.322465 -2.538006 -0.098591
C  -2.803096 -2.513314 0.33919
H  -0.311615 0.71882 -0.229864
H  0.364946 2.196054 -2.206422
H  1.088318 3.326851 -1.03866
H  0.441986 3.135305 1.520299
H  -0.162996 1.568702 2.067038
H  1.897016 0.400108 -1.60342
H  2.901805 1.847913 -1.774783
H  2.301628 1.366218 2.360028
H  4.283834 0.510278 1.481811
H  4.773241 1.264822 -0.056804
H  -3.629862 2.12545 -0.802763
H  -2.489605 0.893489 -1.401263
H  5.222161 -1.147269 -0.098099
H  4.039863 -0.728915 -1.348163
H  -3.347818 1.269667 1.532618
H  -2.140736 0.087071 0.994212
H  -0.891329 4.510459 0.036692
H  -2.712643 4.288866 -0.28869
H  3.222025 -1.877391 1.435286
H  -5.169064 0.103544 0.253147
H  2.54679 -3.800993 -2.184065
H  1.192635 -2.653346 -2.137693
H  2.862755 -2.054549 -2.370485
H  0.420957 -3.471088 0.229724
H  1.633205 -3.555176 1.545149
H  1.696376 -4.707679 0.175522
H  -5.49872 -3.306593 0.680609
H  -6.228491 -1.911599 -0.172516
H  -5.200911 -3.082206 -1.056792
H  -1.917973 -1.891342 0.550673
H  -2.609959 -3.073801 -0.597652
H  -2.888327 -3.268818 1.145789
