program: Gaussian 09
title: 000101739
version: EM64L-G09RevD.01
frameworkgroup: C1[X(C15H22O4)]
method: RPBEPBE
basis: SDD
operation: Freq
keyword: #pfreq=noraman
keyword: PBEPBE/SDD
title: #p freq=noraman PBEPBE/SDD
converged: YES YES NO NO
title: Mulliken charges:
elementType: O O O O C C C C C C C C C C C C C C C H H H H H H H H H H H H H H H H H H H H H H
charge: -0.456331 -0.301379 -0.412648 -0.394071 -0.312440 0.452097 -0.002117 -0.041344 -0.499912 0.064123 -0.174040 0.237624 -0.659584 -0.696244 -0.708316 -0.295207 0.389607 -0.790488 -0.810226 0.239027 0.230936 0.224228 0.273553 0.257502 0.190120 0.210236 0.211966 0.224473 0.215052 0.209623 0.219244 0.226541 0.361426 0.385823 0.364163 0.220199 0.226796 0.218404 0.265751 0.221733 0.214101
chargesum: 0.00000
title: Mulliken charges with hydrogens summed into heavy atoms:
elementType: O O O O C C C C C C C C C C C C C C C
charge: -0.094905 -0.301379 -0.048485 -0.008248 -0.073413 0.452097 -0.002117 0.189592 -0.002131 0.064123 -0.174040 0.237624 -0.211961 -0.049568 -0.064397 -0.068666 0.389607 -0.125090 -0.108641
polarizability: 2.84343076e+02 -8.41011719e+00 1.64022269e+02 -8.28570546e+00 1.02339624e+01 1.32071601e+02
1716.lowfreq: -16.3146 -7.9855 -0.0001 0.0004 0.0005 3.3911 13.6006 17.9849 30.7047
frequency: -4.4879 16.5175 30.3160 46.2622 51.2625 56.8697 85.7842 97.9406 112.5935 152.2838 160.9668 176.7948 188.1201 195.5823 208.0111 223.9086 242.6095 260.7937 270.1254 307.6577 318.8200 332.8294 338.5807 367.2398 372.4220 396.0108 408.3585 428.2080 441.1931 453.7022 488.8866 524.5905 541.7744 566.1474 578.0967 650.2501 681.1499 727.5398 764.3700 787.2107 818.7844 843.2829 864.0062 876.2801 914.3276 921.3803 925.2089 938.4650 947.1412 953.5617 956.4655 989.6282 996.2941 1009.2635 1068.9176 1083.1401 1094.8931 1107.4512 1127.0805 1144.6180 1161.2046 1169.7459 1170.9682 1206.0378 1221.4861 1231.6473 1247.8065 1276.2240 1284.2044 1287.0031 1306.3632 1332.6223 1339.2233 1346.5562 1352.6076 1376.0334 1387.0948 1390.2875 1394.7166 1401.8471 1448.2289 1450.5836 1454.2316 1459.5133 1465.0671 1468.3349 1469.3491 1470.1444 1480.1611 1484.4112 1489.7685 1579.2695 1616.7576 1644.8431 1687.8902 2791.7612 2940.1266 2943.0032 2958.6864 2964.7540 2968.2229 2972.2093 2990.6504 2997.5525 3028.8405 3031.1401 3034.9678 3061.1999 3069.1261 3069.9174 3073.7744 3077.9084 3085.4764 3086.4785 3096.1222 3530.7971 3553.2460
redmass: 3.1626 2.8272 3.2703 3.2856 3.2593 4.5347 1.2624 4.6587 4.7564 3.3667 2.9881 1.4323 3.1172 1.1316 3.5058 1.3922 2.4415 3.4892 3.3958 3.1072 1.9969 1.5862 3.6202 2.5743 2.3170 2.3852 2.2897 1.3669 2.5751 4.9826 4.8213 3.4998 3.5333 5.8128 5.1769 3.2995 5.3753 6.0711 2.5689 6.1195 3.0521 2.0327 2.3285 1.6270 1.2424 2.3852 2.9604 1.1658 1.9329 1.3633 1.5088 1.2855 3.7831 2.2257 3.2327 1.6751 1.7672 1.9924 2.3735 1.7710 1.3028 1.7661 1.8442 1.8893 1.5689 2.2666 1.7959 1.3460 1.3255 1.4121 2.4239 1.4547 1.4954 2.2975 1.4844 1.2213 2.6534 1.3227 1.2219 1.2231 1.3961 1.4196 1.0621 1.2630 1.0468 1.0598 1.0589 1.0773 1.0532 1.0490 1.0750 4.8557 4.3110 7.4141 6.3464 1.0739 1.0677 1.0814 1.0373 1.0390 1.0353 1.0360 1.0637 1.0843 1.0905 1.0969 1.0958 1.0998 1.1000 1.0991 1.0991 1.0975 1.0913 1.0971 1.0974 1.0658 1.0652
irintensity: 0.1656 0.2993 0.2685 0.5839 0.1570 0.0965 0.4527 2.5313 0.0332 0.3569 1.0769 1.4185 9.3371 0.7604 5.4768 7.4315 7.3473 9.5231 1.9293 19.1633 12.0086 116.4561 4.9204 4.1796 1.5994 2.9364 4.6997 96.6964 18.2200 3.9753 8.3550 4.4344 3.8386 5.2517 4.2243 2.6812 8.1078 7.4585 9.4421 24.6883 2.6002 60.1016 6.7425 11.8365 18.9458 18.9229 63.3211 120.5439 9.8771 0.6370 8.1365 6.7514 20.8513 11.6172 38.0797 6.3605 11.4683 27.7256 7.1051 70.1687 58.1176 30.1502 75.4537 41.8542 76.2010 53.2679 21.1584 0.4437 6.2800 11.5821 30.6524 28.9659 10.1720 19.1323 4.4793 15.5556 167.8776 26.1415 18.1959 15.3473 14.5707 5.2789 3.8425 14.0698 0.4251 29.7240 16.5378 9.6701 12.3844 23.0903 7.8272 128.1743 159.6943 345.9192 1.2717 135.4189 57.2347 27.1594 33.4215 62.8985 41.4480 21.8577 20.2354 7.1258 9.5500 7.8628 40.8298 12.6472 24.8514 49.8940 75.7551 11.1358 42.8919 15.2801 19.2430 8.7101 17.7914
temp: 298.150 k
press: 1.00000 atm
elementType: 8 8 8 8 6 6 6 6 6 6 6 6 6 6 6 6 6 6 6 1 1 1 1 1 1 1 1 1 1 1 1 1 1 1 1 1 1 1 1 1 1
symmnumber: 1
zpe: 888288.0 jmol-1
zpe.correction: 0.338331 hartree
zpe.thermalcorrener: 0.359514 hartree
zpe.thermalcorrenthalpy: 0.360458 hartree
zpe.thermalcorrgfe: 0.287151 hartree
zpe.sumelectzpe: -884.187483 hartree
zpe.sumelectthermal: -884.166301 hartree
zpe.sumelectthermalent: -884.165356 hartree
zpe.sumelectthermalfe: -884.238663 hartree
dipole: -1.3309 -2.9924 -0.1569
dipole: 3.2788
quadrupole: -108.1067 -116.2244 -114.7292
quadrupole: -3.4509 -3.7312 2.2236
quadrupole: 4.9134 -3.2043 -1.7091 -3.4509 -3.7312 2.2236
hfenergy: -884.5258142 hartree
pointgroup: C01 [X(C15H22O4)]
dipole: -0.5412948 1.1492758 -0.2241015 debye
polarizability: 283.4613141|12.3907881|167.3662114|10.141978|2.4780579|129.6094201 unknown
InChI: InChI=1S/C15H22O4/c1-8(2)5-6-10-13(17)12(15(19)14(10)18)11(16)7-9(3)4/h5,9,14,16-18H,6-7H2,1-4H3
charge 0 multiplicity 1
41 atoms
O  -2.059414 -2.03866 1.048194
O  0.568601 -2.891095 -0.260839
O  0.698869 1.784832 1.023852
O  2.97792 -1.947746 0.035053
C  -1.280572 -1.231917 0.08623
C  -1.172775 0.204906 0.552283
C  1.056058 -0.57358 0.336729
C  4.35422 0.690651 -0.624381
C  3.473001 0.341401 0.620856
C  0.187546 -1.691097 0.014519
C  0.15578 0.549443 0.658115
C  2.446478 -0.715768 0.33702
C  -2.399906 1.043645 0.821894
C  3.506992 1.322302 -1.753028
C  5.501849 1.632634 -0.196173
C  -3.206576 1.326901 -0.441911
C  -4.39174 0.754692 -0.803227
C  -5.081235 1.154563 -2.098653
C  -5.126437 -0.292994 0.017394
H  -1.748074 -1.309113 -0.920299
H  4.791745 -0.256842 -0.996336
H  4.139911 -0.038602 1.420392
H  2.96967 1.250977 0.987713
H  -3.025966 0.523059 1.56964
H  -2.117039 2.013345 1.287144
H  3.026617 2.256602 -1.404375
H  4.140037 1.567233 -2.625867
H  2.707655 0.639685 -2.094954
H  6.136064 1.169184 0.582512
H  5.102261 2.582082 0.209309
H  6.148122 1.880353 -1.058376
H  -2.752344 2.058029 -1.127742
H  -1.953869 -2.993963 0.796051
H  2.208931 -2.615958 -0.142954
H  -0.024345 2.426035 1.242133
H  -5.182334 0.285553 -2.778971
H  -4.531123 1.948417 -2.633313
H  -6.108476 1.52114 -1.901624
H  -4.498625 -0.745794 0.801175
H  -6.028141 0.142097 0.493733
H  -5.482036 -1.110934 -0.63912
