program: Gaussian 09
title: 000101859
version: EM64L-G09RevD.01
frameworkgroup: C1[X(C21H26F2O5)]
method: RPBEPBE
basis: SDD
operation: Freq
keyword: #p
keyword: freq=noraman
keyword: PBEPBE/SDD
title: #p freq=noraman PBEPBE/SDD
converged: YES YES NO NO
title: Mulliken charges:
elementType: F F O O O O O C C C C C C C C C C C C C C C C C C C C C H H H H H H H H H H H H H H H H H H H H H H H H H H
charge: -0.210443 -0.217170 -0.452363 -0.465382 -0.256334 -0.435801 -0.240449 0.371976 -0.092843 -0.281143 0.313036 0.158983 -0.646627 -0.245033 -0.563109 0.031376 -0.513912 -0.489999 -0.872185 -0.169259 0.456200 0.041334 -0.759654 -0.181606 -0.579508 -0.374611 -0.392297 0.195719 0.311068 0.260770 0.267672 0.243596 0.257160 0.234309 0.233056 0.229889 0.258002 0.239242 0.263383 0.223758 0.226319 0.278481 0.216749 0.243607 0.207799 0.284932 0.263029 0.364249 0.356322 0.295530 0.229349 0.258941 0.254130 0.369759
chargesum: 0.00000
title: Mulliken charges with hydrogens summed into heavy atoms:
elementType: F F O O O O O C C C C C C C C C C C C C C C C C C C C C
charge: -0.210443 -0.217170 -0.088115 -0.109060 -0.256334 -0.066042 -0.240449 0.371976 0.218225 -0.020373 0.313036 0.158983 -0.135358 0.012127 -0.095744 0.031376 -0.026022 0.012627 -0.143627 0.047491 0.456200 0.041334 -0.023316 0.081423 -0.283978 0.113679 -0.138167 0.195719
polarizability: 3.10154956e+02 -1.95960109e+00 2.14035029e+02 -2.89060303e+01 7.73480880e+00 1.86861141e+02
1716.lowfreq: -7.8293 -0.0005 0.0001 0.0006 5.0340 7.8200 28.6990 37.0192 51.7116
frequency: 28.6781 37.0105 51.6857 59.5803 72.5607 84.2356 119.4474 138.2383 150.6577 158.4691 168.6340 175.1954 196.0665 197.2503 213.5472 216.9835 224.2871 242.1258 245.4748 264.9394 275.7184 285.9648 293.4399 308.6464 311.1508 317.3066 333.4224 339.0697 351.2241 378.4489 389.5204 394.4996 403.5375 425.4716 431.5660 438.2409 457.5423 466.0271 491.0745 491.4703 497.7847 514.8708 528.3477 536.8595 573.1643 590.3340 603.9864 638.2366 658.8782 676.8175 693.1467 707.4872 747.5330 762.7612 794.7349 804.1669 824.5226 842.0313 854.3712 872.6171 884.3642 894.1847 917.5485 923.7092 933.3277 937.1858 949.5957 958.8182 960.3694 976.7244 991.4699 1001.3444 1013.0761 1017.1014 1020.8445 1029.5913 1048.0112 1049.3122 1054.9636 1060.9492 1091.9847 1097.7993 1110.6926 1122.8677 1128.9166 1136.7085 1148.6178 1160.7867 1162.9250 1182.9569 1183.9771 1188.5104 1217.3868 1224.8217 1231.1543 1247.3930 1255.4813 1260.5761 1270.6521 1275.7528 1284.0411 1293.4194 1297.3586 1300.4114 1305.2362 1319.1415 1331.2663 1344.0168 1351.6850 1354.5939 1358.7947 1372.9163 1379.8487 1380.9584 1383.2960 1392.2448 1402.1893 1439.9847 1455.3071 1462.0038 1464.8879 1466.4958 1474.1578 1489.0155 1490.8495 1504.2364 1561.0843 1567.2366 1624.2653 1670.2975 2922.1705 2969.1039 2979.2762 2984.4101 2988.6259 2988.7660 2996.0604 3002.7571 3009.2035 3014.5596 3027.1080 3044.1578 3051.6591 3063.5303 3067.0463 3081.6759 3092.4373 3093.5866 3095.7743 3112.5211 3132.1750 3152.2467 3166.7824 3445.0345 3466.4718 3565.6307
redmass: 7.9423 6.2249 8.1860 5.8686 6.3468 3.9004 5.3174 3.4066 3.7865 3.0833 3.9964 4.2989 4.2374 2.0175 3.8951 3.9185 3.4335 2.9352 3.0898 3.3680 2.9353 1.6284 3.0701 3.5048 3.5700 1.2280 2.6436 4.5502 3.6528 3.3213 6.9879 3.3526 1.5949 3.6570 3.6685 3.5375 2.4401 3.7814 2.1455 1.5559 4.0299 3.8527 4.0303 3.2576 4.1429 2.9934 3.6377 4.0852 3.4925 3.1989 3.2647 4.0834 4.9085 3.8687 1.9426 3.0676 1.7262 2.4251 2.8187 3.0798 2.8464 2.9632 2.2720 2.0793 2.0165 2.7061 2.6269 2.1668 2.3371 3.2643 2.2801 1.3340 3.7324 2.7388 2.5339 2.4344 2.9221 3.6151 2.6454 2.4121 3.3239 2.0501 2.2939 2.1398 2.0382 2.1089 1.8422 1.9196 2.3311 1.8066 1.6694 1.2310 1.8069 1.4313 1.3301 1.3792 1.3859 1.4253 1.2759 1.6182 2.0100 1.4195 1.4852 1.4489 1.4210 1.5797 1.5450 1.6813 1.4527 1.4661 1.3342 1.6755 1.6159 1.3686 1.3453 1.4317 1.2012 1.0761 1.0795 1.0707 1.0836 1.0906 1.0634 1.0856 1.0515 1.0536 9.1861 7.8765 8.7083 7.6406 1.0705 1.0669 1.0417 1.0811 1.0772 1.0788 1.0694 1.0402 1.0785 1.0594 1.0625 1.0874 1.0947 1.0977 1.0992 1.1040 1.0993 1.0995 1.1007 1.0866 1.0991 1.0978 1.0922 1.0643 1.0647 1.0659
irintensity: 3.1639 1.3590 1.0372 1.1269 1.1907 0.8457 0.4831 0.2511 7.2981 2.5841 5.0546 2.5913 0.8339 5.3751 2.7736 26.7257 0.5924 2.4508 6.4336 1.9922 1.2026 26.1854 0.4035 11.4511 2.4650 118.5099 17.0233 17.9960 19.2337 44.4290 16.4518 0.8921 41.1203 37.1130 36.4815 6.9379 26.9610 11.9143 38.6844 74.1396 7.2136 1.5283 6.3309 5.3088 1.9789 21.9807 5.2209 8.8562 2.6881 3.0057 11.8055 8.3684 1.8180 2.7999 4.8022 3.5190 18.9237 3.7343 24.7699 4.0057 16.0450 30.7143 23.4585 37.2342 11.2184 66.1810 11.5333 31.8934 19.0175 46.6513 10.1150 1.4913 82.1227 51.8922 25.9436 25.3072 9.8280 23.4670 27.7873 30.3027 20.0119 2.4212 1.8588 24.5448 12.2760 20.3868 4.8485 8.2546 0.5208 3.1617 8.0009 28.0134 17.1907 5.5171 11.9287 17.5667 124.7320 12.7411 2.7984 2.9107 40.6504 24.5709 3.2785 3.3787 22.7064 4.9567 3.2641 39.0133 8.7789 4.7443 4.6916 10.9419 0.5598 67.3698 3.2313 25.3300 22.7866 13.9416 4.1775 6.3985 8.4654 5.2898 27.3104 2.9986 10.0554 6.7002 201.0354 65.3783 8.3201 106.4204 33.2609 17.7755 32.7568 36.5574 1.3923 22.1109 15.4032 17.9211 19.1858 20.2747 30.1488 16.3605 7.0205 30.9415 5.5994 13.7483 37.6939 13.5043 16.1844 4.9556 2.8858 12.8316 0.0789 17.0084 34.1016 8.4217
temp: 298.150 k
press: 1.00000 atm
elementType: 9 9 8 8 8 8 8 6 6 6 6 6 6 6 6 6 6 6 6 6 6 6 6 6 6 6 6 6 1 1 1 1 1 1 1 1 1 1 1 1 1 1 1 1 1 1 1 1 1 1 1 1 1 1
symmnumber: 1
zpe: 1140684.3 jmol-1
zpe.correction: 0.434464 hartree
zpe.thermalcorrener: 0.460956 hartree
zpe.thermalcorrenthalpy: 0.461901 hartree
zpe.thermalcorrgfe: 0.380350 hartree
zpe.sumelectzpe: -1389.474135 hartree
zpe.sumelectthermal: -1389.447643 hartree
zpe.sumelectthermalent: -1389.446699 hartree
zpe.sumelectthermalfe: -1389.528249 hartree
dipole: -6.1513 -0.5715 4.4605
dipole: 7.6198
quadrupole: -224.5913 -156.8470 -171.5163
quadrupole: -9.4343 17.4007 2.4315
quadrupole: -40.2731 27.4712 12.8019 -9.4343 17.4007 2.4315
hfenergy: -1389.9085992 hartree
pointgroup: C01 [X(C21H26F2O5)]
dipole: 2.4177308 0.2436163 1.7556577 debye
polarizability: 310.268806|-0.6087443|214.2051008|28.8812888|-6.7828249|186.5772192 unknown
InChI: InChI=1S/C21H26F2O5/c1-18-5-3-11(25)7-14(18)15(22)8-13-12-4-6-20(28,17(27)10-24)19(12,2)9-16(26)21(13,18)23/h3,5,7,12-13,15-16,24,26,28H,4,6,8-10H2,1-2H3
charge 0 multiplicity 1
54 atoms
F  -1.233879 0.20695 -1.403589
F  -3.457758 -3.085121 0.24212
O  3.025505 -0.348178 -2.195714
O  -0.010565 2.198009 1.416298
O  4.754922 1.449961 -1.175926
O  6.538479 1.096773 0.796255
O  -6.093924 0.791822 -1.446412
C  2.022276 0.102255 0.068855
C  1.064743 -1.100804 -0.191569
C  -0.297998 -0.945353 0.51219
C  -0.973628 0.381252 0.058225
C  3.292384 -0.427891 -0.749575
C  1.366579 1.365681 -0.522496
C  -0.051309 1.638914 0.047376
C  1.925547 -2.348062 0.113293
C  -2.411968 0.57909 0.697416
C  3.355372 -1.943401 -0.384541
C  -1.215304 -2.156207 0.19224
C  2.383138 0.283733 1.566771
C  -2.640673 -1.973262 0.735488
C  -3.242498 -0.650469 0.309892
C  4.54188 0.41347 -0.472123
C  -2.362734 0.674003 2.26749
C  -3.037769 1.874375 0.211057
C  -4.422532 -0.569142 -0.367863
C  5.576913 0.039461 0.582976
C  -4.219519 1.942137 -0.460225
C  -4.99172 0.723786 -0.809899
H  0.869199 -1.099071 -1.282748
H  -0.141243 -0.884323 1.607044
H  1.261759 1.229177 -1.614368
H  1.989534 2.270618 -0.364009
H  -0.542788 2.374361 -0.622165
H  1.558987 -3.247312 -0.409174
H  1.932367 -2.575187 1.196495
H  4.118644 -2.155691 0.383922
H  3.640983 -2.490687 -1.297896
H  -0.781709 -3.079063 0.615863
H  -1.283062 -2.279021 -0.903767
H  2.878093 -0.609336 1.988307
H  3.061899 1.146421 1.707036
H  1.483632 0.489699 2.167365
H  -2.65799 -2.075274 1.83927
H  -3.397748 0.720033 2.647978
H  -1.86863 -0.199584 2.726026
H  -1.81478 1.575018 2.576936
H  -2.504026 2.790609 0.496114
H  3.34699 0.543603 -2.505625
H  0.677247 2.910198 1.437976
H  -4.987932 -1.472646 -0.616636
H  6.080503 -0.886208 0.218564
H  5.098742 -0.205406 1.547724
H  -4.65815 2.899991 -0.762898
H  6.46062 1.727901 0.026158
