program: Gaussian 09
title: 000101744
version: EM64L-G09RevD.01
frameworkgroup: C1[X(C19H22N2O)]
method: RPBEPBE
basis: SDD
operation: Freq
keyword: #p
keyword: freq=noraman
keyword: PBEPBE/SDD
title: #p freq=noraman PBEPBE/SDD
converged: NO YES NO NO
title: Mulliken charges:
elementType: O N N C C C C C C C C C C C C C C C C C C C H H H H H H H H H H H H H H H H H H H H H H
charge: -0.448623 -0.027528 -0.022277 -0.124978 -0.057163 -0.532740 -0.136601 -0.493023 -0.534040 -0.457905 -0.349483 -0.055727 0.417737 0.226417 -0.632666 -0.339548 -0.063768 -0.354604 -0.384836 -0.311697 -0.274736 -0.227405 0.230141 0.271633 0.242444 0.236510 0.200687 0.216985 0.216545 0.238605 0.244512 0.214169 0.224970 0.212980 0.229483 0.349193 0.216016 0.217190 0.262634 0.203489 0.236441 0.261512 0.227586 0.231468
chargesum: 0.00000
title: Mulliken charges with hydrogens summed into heavy atoms:
elementType: O N N C C C C C C C C C C C C C C C C C C C
charge: -0.099430 -0.027528 -0.022277 0.105163 0.214470 -0.053786 0.064086 -0.059493 -0.050924 -0.018765 -0.136503 0.173756 0.417737 0.226417 -0.199460 -0.076914 -0.063768 -0.151115 -0.148395 -0.050185 -0.047150 0.004063
polarizability: 2.62694878e+02 -2.63208566e+01 2.33314760e+02 1.64384428e+01 5.29636194e+00 1.57080940e+02
1716.lowfreq: -25.3744 -9.0143 -5.0593 -0.0007 -0.0006 0.0003 7.0221 31.5050 38.1382
frequency: -20.0914 30.8565 38.1362 57.4842 73.6566 116.9341 149.6641 171.8394 178.8345 192.3304 226.0404 254.8165 256.2699 283.0849 327.1655 331.9881 346.4437 369.6479 377.1200 410.3354 431.4907 460.4851 472.4135 488.3743 512.7643 525.1327 555.7558 577.9502 598.6795 606.3438 629.4628 661.3808 669.5672 742.1964 763.5746 768.7378 776.8163 795.3990 808.3634 810.3324 820.5917 841.7061 857.4267 868.4001 883.1159 907.7082 924.8057 937.4964 941.8837 954.2444 960.8875 968.5510 976.4708 995.6095 996.5310 1003.0902 1015.4228 1023.6287 1027.0896 1041.9608 1051.8943 1060.4370 1078.8106 1083.9708 1114.1357 1140.6415 1142.5537 1155.4698 1173.9033 1195.9231 1205.2064 1219.5155 1223.0666 1239.1632 1248.7555 1253.4652 1257.6349 1281.6792 1287.0830 1296.0301 1298.5094 1305.8274 1310.9154 1314.3501 1316.9016 1330.2806 1336.1773 1341.4478 1344.0608 1369.5661 1378.7708 1384.4830 1429.5093 1431.3620 1452.1604 1463.6280 1465.6054 1472.2298 1481.8704 1510.0919 1552.8003 1579.8741 1622.4212 1651.2946 2973.7502 2979.3003 2982.8103 2999.3460 3000.3691 3002.7827 3006.9873 3033.9745 3037.9128 3060.9590 3063.2286 3069.5903 3070.9328 3086.5266 3119.9956 3129.9440 3144.9497 3157.0175 3160.8744 3172.3764 3191.2401 3560.2594
redmass: 4.2609 4.3178 4.8048 4.1549 2.8958 4.0386 3.4413 4.5368 4.4691 3.1024 2.9387 2.2050 2.6318 3.4501 1.4726 2.3993 2.0920 2.6846 3.1721 3.7575 2.7324 3.2055 3.2804 4.4070 5.7336 6.4228 4.0128 4.5150 3.3934 4.0990 6.1032 3.3865 1.9535 5.0126 1.7790 2.1815 2.6681 2.7171 3.0309 1.9907 2.1063 3.7884 2.1894 1.4971 1.7963 2.9076 2.4853 1.3494 1.8121 6.2292 1.3814 1.4804 2.3443 1.3519 1.6531 1.2814 3.4273 2.5933 2.3361 2.5564 2.1466 2.3972 2.4649 3.1409 1.9447 1.1533 1.3077 1.4935 1.1873 1.4349 1.4241 1.9579 1.5160 1.6398 1.4958 1.7158 1.4446 1.3008 1.3418 1.2627 1.4372 1.3474 1.3238 1.4247 1.3466 1.3612 1.3952 2.0653 1.5875 1.3960 3.1679 1.8803 1.2062 2.8450 2.7039 1.0801 1.0838 1.0833 1.0871 3.8291 6.7908 6.6508 6.4717 4.6692 1.0817 1.0827 1.0595 1.0678 1.0706 1.0723 1.0615 1.0906 1.1004 1.1013 1.0923 1.0940 1.1037 1.0712 1.0892 1.0853 1.0892 1.0944 1.0949 1.0995 1.1142 1.0661
irintensity: 0.2630 0.0460 0.1452 0.5526 0.0310 1.1070 0.3609 0.1000 7.5320 0.7996 2.2308 0.2824 0.0314 8.6350 100.6131 36.6203 1.2740 2.0124 2.9689 4.1874 8.7587 4.1169 0.1187 5.9041 5.8759 0.1923 7.6322 2.2220 1.3062 5.5632 4.9795 3.0636 12.2602 3.3049 46.3952 30.8269 25.9495 2.8828 9.3274 6.3863 15.9855 0.8484 41.2107 5.3910 5.2644 8.5196 15.7166 62.2744 6.6015 57.4309 4.0686 0.1431 6.2238 2.2877 12.1625 6.8026 12.9840 17.4107 14.8540 17.3155 1.0737 13.4288 6.8906 14.6973 14.8587 0.8913 4.8395 14.5870 1.4527 4.9150 15.6633 0.8017 0.4908 5.1081 11.6557 9.4459 5.0198 3.1010 11.5188 2.4215 10.0199 1.1287 11.9381 3.4058 0.1589 4.9894 3.1088 0.4323 15.4423 2.4722 0.3017 11.9333 5.2947 9.1957 2.1347 3.1452 11.4677 14.3134 6.1244 24.5085 13.0845 17.7816 2.6163 28.2670 13.8782 21.8881 39.9102 43.7688 20.3252 26.3135 69.5184 35.0091 19.8880 8.5974 7.0630 73.6575 62.6597 6.6161 25.1822 1.1469 14.8432 12.0943 27.9465 20.4656 25.0434 9.2410
temp: 298.150 k
press: 1.00000 atm
elementType: 8 7 7 6 6 6 6 6 6 6 6 6 6 6 6 6 6 6 6 6 6 6 1 1 1 1 1 1 1 1 1 1 1 1 1 1 1 1 1 1 1 1 1 1
symmnumber: 1
zpe: 966900.2 jmol-1
zpe.correction: 0.368273 hartree
zpe.thermalcorrener: 0.386169 hartree
zpe.thermalcorrenthalpy: 0.387114 hartree
zpe.thermalcorrgfe: 0.322506 hartree
zpe.sumelectzpe: -920.294309 hartree
zpe.sumelectthermal: -920.276412 hartree
zpe.sumelectthermalent: -920.275468 hartree
zpe.sumelectthermalfe: -920.340076 hartree
dipole: 1.5486 2.3072 1.4775
dipole: 3.1471
quadrupole: -135.2388 -121.4275 -132.3271
quadrupole: -5.0060 -5.9145 -1.4263
quadrupole: -5.5743 8.2370 -2.6626 -5.0060 -5.9145 -1.4263
hfenergy: -920.6625817 hartree
pointgroup: C01 [X(C19H22N2O1)]
dipole: 0.5519026 1.0027459 0.4721948 debye
polarizability: 263.7916802|-22.401595|231.2391382|22.571155|-4.351229|158.05976 unknown
InChI: InChI=1S/C19H22N2O/c1-2-13-12-21-10-8-14(13)11-18(21)19(22)16-7-9-20-17-6-4-3-5-15(16)17/h2-7,9,13-14,18-19,22H,1,8,10-12H2
charge 0 multiplicity 1
44 atoms
O  0.25467 -0.983733 2.686958
N  1.166794 0.686507 -0.547574
N  -3.367126 -2.120084 -0.693467
C  3.46648 1.032275 0.612444
C  1.259127 -0.190631 0.665808
C  2.528289 0.173643 1.507053
C  3.68989 0.367247 -0.790622
C  2.784414 2.407276 0.386122
C  2.260591 0.281679 -1.481323
C  1.352135 2.132584 -0.197637
C  -0.057001 -0.176715 1.48464
C  4.367973 -0.981233 -0.708136
C  -1.228552 -0.788669 0.717894
C  -2.290973 -0.013266 0.123156
C  5.577158 -1.283822 -1.244473
C  -1.283074 -2.183728 0.589171
C  -3.345177 -0.734495 -0.572792
C  -2.379366 1.417812 0.180724
C  -2.355922 -2.800982 -0.121092
C  -4.424215 -0.010188 -1.174434
C  -3.445819 2.098309 -0.410406
C  -4.477694 1.381789 -1.095468
H  4.443344 1.164381 1.111392
H  1.365598 -1.224666 0.284041
H  3.027833 -0.74094 1.867933
H  2.250925 0.751678 2.408792
H  4.339111 1.045169 -1.380412
H  3.387288 3.022138 -0.309258
H  2.721211 2.957191 1.344098
H  2.219549 0.944476 -2.364509
H  2.056507 -0.746676 -1.829959
H  0.571005 2.42409 0.525859
H  1.172518 2.719357 -1.116191
H  -0.29277 0.859537 1.801521
H  3.812998 -1.772786 -0.178478
H  -0.580993 -1.117554 3.202435
H  6.012426 -2.285938 -1.159133
H  6.167845 -0.533876 -1.786483
H  -0.502873 -2.803387 1.042403
H  -1.597131 1.992324 0.68557
H  -2.389281 -3.892486 -0.224111
H  -5.192091 -0.595116 -1.689908
H  -3.493433 3.191465 -0.353577
H  -5.306287 1.930143 -1.556772
