program: Gaussian 09
title: 000101640
version: EM64L-G09RevD.01
frameworkgroup: C1[X(C8F16)]
method: RPBEPBE
basis: SDD
operation: Freq
keyword: #p
keyword: freq=noraman
keyword: PBEPBE/SDD
title: #p freq=noraman PBEPBE/SDD
converged: YES YES NO NO
title: Mulliken charges:
elementType: F F F F F F F F F F F F F F F F C C C C C C C C
charge: -0.125607 -0.125610 -0.106869 -0.106194 -0.106213 -0.106882 -0.113567 -0.112888 -0.113558 -0.112893 -0.119496 -0.106526 -0.106982 -0.119503 -0.106528 -0.106945 0.057708 0.057772 0.226550 0.226566 0.222687 0.222629 0.391184 0.391164
chargesum: 0.00000
title: Mulliken charges with hydrogens summed into heavy atoms:
polarizability: 9.41562055e+01 -2.39617222e-03 9.46939452e+01 -1.90887689e-03 3.58267313e-01 8.74610081e+01
1716.lowfreq: -6.8669 -0.0005 -0.0004 0.0012 4.2610 6.5315 23.5795 48.6194 63.0517
frequency: 23.0457 48.5971 63.0487 74.5175 104.9150 129.0891 141.6257 162.0773 163.1455 187.8529 203.8761 205.9161 239.2385 247.3364 250.6804 257.3298 267.8536 271.9258 276.7787 278.3992 287.3900 293.8124 294.6140 301.7502 302.5639 309.6966 340.1635 354.5486 391.9587 410.6101 420.3275 456.3782 467.0411 479.2492 513.9372 532.3999 548.6684 552.0448 594.8292 597.7681 636.4495 650.4663 783.7068 811.5108 843.2856 910.1221 944.1772 971.5990 971.6923 995.7774 1008.7332 1024.9952 1034.0350 1050.6322 1056.8183 1063.3002 1079.0921 1083.2661 1091.7189 1096.6187 1110.0831 1137.8712 1148.5286 1175.9747 1183.5446 1191.8625
redmass: 18.7191 18.4887 18.5302 18.5883 18.5720 18.3551 18.0078 18.0412 18.2906 18.2685 18.0812 18.4412 18.1120 18.5641 18.4181 18.2522 18.3868 18.2794 18.3855 18.4621 18.5151 18.4610 18.2767 18.4223 18.5171 18.7272 17.1353 17.9788 17.3377 17.6036 17.6955 17.7308 17.7375 17.6649 17.5718 17.3097 17.4389 17.1081 17.4965 17.3549 16.8144 17.2301 12.8756 13.9794 14.0408 13.7925 13.6662 13.6129 13.4817 13.2542 12.8505 13.1972 13.2988 13.0575 12.6138 12.7153 12.9350 12.8629 13.0843 12.5948 12.4050 12.5935 12.3304 12.5736 12.2259 12.2823
irintensity: 0.1350 0.0733 0.0876 0.0050 0.1325 0.5980 0.1319 0.1284 3.7320 2.9198 1.7025 0.4574 0.0282 0.1446 2.0723 0.7187 1.2389 0.9954 0.9115 5.1646 0.0531 1.0176 1.9472 0.7901 0.0715 0.3902 0.9575 3.1797 6.2382 13.8933 12.1802 4.9383 0.1933 2.6944 1.3214 0.7608 1.2273 7.1477 20.8976 12.2035 55.0560 14.9178 7.4204 90.4483 154.7185 119.8602 47.3515 29.7808 3.5276 6.4625 2.8409 9.6914 64.5249 47.8114 6.5179 148.7558 139.6283 212.9517 209.0530 69.4290 176.6551 342.1699 68.9073 6.8226 47.4548 17.6177
temp: 298.150 k
press: 1.00000 atm
elementType: 9 9 9 9 9 9 9 9 9 9 9 9 9 9 9 9 6 6 6 6 6 6 6 6
symmnumber: 1
zpe: 227905.7 jmol-1
zpe.correction: 0.086805 hartree
zpe.thermalcorrener: 0.108891 hartree
zpe.thermalcorrenthalpy: 0.109835 hartree
zpe.thermalcorrgfe: 0.036882 hartree
zpe.sumelectzpe: -1900.405519 hartree
zpe.sumelectthermal: -1900.383433 hartree
zpe.sumelectthermalent: -1900.382488 hartree
zpe.sumelectthermalfe: -1900.455441 hartree
dipole: -0.2504 -0.0004 0.0005
dipole: 0.2504
quadrupole: -136.8366 -136.2146 -137.1347
quadrupole: -0.0019 0.0021 -0.5063
quadrupole: -0.1080 0.5141 -0.4061 -0.0019 0.0021 -0.5063
hfenergy: -1900.4923234 hartree
pointgroup: C01 [X(C8F16)]
dipole: 0.0000522 -0.0985271 -0.000208 debye
dipolederiv: -0.2579703 0.0120117 0.0013095 0.0304539 -0.3977673 -0.1411382 0.0297893 -0.1736976 -0.3803381 -0.2581017 -0.0121917 0.0016327 -0.0307775 -0.3978702 0.1412629 0.0301323 0.1737069 -0.3804509 -0.3657107 -0.0036906 -0.0932615 0.0090554 -0.2954732 0.0344243 -0.217756 0.0448837 -0.4925263 -0.6526979 -0.0299429 0.1129787 -0.0358992 -0.2873065 0.0245968 0.1987051 0.0152957 -0.2900219 -0.6526244 0.0307439 0.1131281 0.0367069 -0.2874364 -0.0248224 0.1987693 -0.0157135 -0.2901253 -0.3658795 0.0037728 -0.0933241 -0.0090146 -0.2955271 -0.0343932 -0.2178871 -0.0445179 -0.4924268 -0.4102749 0.0123355 -0.193956 -0.0449321 -0.2872399 -0.0477865 -0.1422544 0.0206633 -0.4346655 -0.26481 -0.0751677 0.0702151 -0.0350825 -0.5898432 0.2289167 0.0343548 0.1952043 -0.3869593 -0.4102056 -0.0122823 -0.193822 0.045104 -0.2873273 0.0480724 -0.1423163 -0.0205631 -0.4346425 -0.2646101 0.0745958 0.0697408 0.0344774 -0.5903178 -0.2289546 0.0339508 -0.1952064 -0.3867287 -0.3304246 0.0014889 -0.1136565 0.0575401 -0.421094 -0.1509742 -0.0455265 -0.2233369 -0.56974 -0.7140629 0.0300394 0.2087875 0.0820423 -0.266481 0.0034802 0.1237436 0.0336959 -0.3664031 -0.3252683 0.0188955 -0.0411535 -0.0662609 -0.7159119 0.140268 -0.0120537 0.1573572 -0.2894938 -0.330584 -0.001121 -0.1136552 -0.0574263 -0.4219462 0.151328 -0.0457018 0.22383 -0.5687932 -0.7142123 -0.0303917 0.2088175 -0.0822968 -0.2662411 -0.0031936 0.123948 -0.0332787 -0.366537 -0.3255047 -0.0190743 -0.0411912 0.0663161 -0.7151092 -0.1409377 -0.0118585 -0.1582114 -0.2899982 0.1600731 0.0001355 -0.0219383 0.0065417 0.2606594 0.2519663 -0.1343024 0.1752881 0.2850101 0.1601061 0.0000354 -0.022455 -0.0062096 0.261007 -0.2520376 -0.134541 -0.1750239 0.2852693 1.0102323 0.1079892 -0.0155584 -0.0086769 0.6614063 -0.1282435 -0.027027 -0.0834657 0.8122384 1.0102941 -0.108731 -0.0155253 0.0079462 0.661578 0.1284418 -0.0270317 0.0836425 0.8121802 0.6817047 0.1100692 0.1095944 0.0700134 0.8839692 -0.2244439 0.1485234 -0.1538248 0.825708 0.6813539 -0.109522 0.1101007 -0.0695112 0.8844963 0.2242811 0.1489181 0.1536266 0.8254363 1.4691998 -0.1502091 -0.0233358 -0.0986181 1.4551949 0.0338678 0.043783 -0.0274966 1.2872252 1.4699779 0.1502114 -0.0234722 0.0985084 1.4545811 -0.0339808 0.0436386 0.0271424 1.2867828 unknown
polarizability: 94.6178028|-0.0010607|94.1561972|-0.8205803|0.0013955|87.5371588 unknown
InChI: InChI=1S/C8F16/c9-1(7(19,20)21)2(10,8(22,23)24)4(13,14)6(17,18)5(15,16)3(1,11)12
charge 0 multiplicity 1
24 atoms
F  -0.657655 1.75963 1.461186
F  0.661925 1.757894 -1.462101
F  -0.253347 -0.618353 2.278789
F  -2.379499 -0.62379 1.499435
F  2.3782 -0.629436 -1.500176
F  0.251803 -0.619974 -2.278713
F  -1.660501 -2.009389 -0.753796
F  -0.879377 -2.984634 1.151344
F  1.656874 -2.01202 0.754365
F  0.87386 -2.986952 -1.150182
F  -2.052961 0.63733 -1.697554
F  -3.096077 1.391177 0.16474
F  -1.62311 2.715563 -0.874056
F  2.055802 0.63101 1.695727
F  3.098365 1.388909 -0.165297
F  1.62566 2.710953 0.876962
C  -0.707896 0.816452 0.378689
C  0.709771 0.814844 -0.379391
C  -1.034821 -0.571646 1.097406
C  1.033801 -0.574231 -1.09764
C  -0.72284 -1.881642 0.296912
C  0.719409 -1.88317 -0.296388
C  -1.883205 1.387694 -0.529568
C  1.88572 1.383881 0.529406
