program: Gaussian 09
title: 000101674
version: EM64L-G09RevD.01
frameworkgroup: C1[X(C22H31FO5)]
method: RPBEPBE
basis: SDD
operation: Freq
keyword: #p
keyword: freq=noraman
keyword: PBEPBE/SDD
title: #p freq=noraman PBEPBE/SDD
converged: YES YES NO NO
title: Mulliken charges:
elementType: F O O O O O C C C C C C C C C C C C C C C C C C C C C C H H H H H H H H H H H H H H H H H H H H H H H H H H H H H H H
charge: -0.232377 -0.460843 -0.439115 -0.231430 -0.235671 -0.446337 0.309058 -0.149977 -0.215934 0.319051 0.106499 0.150823 -0.541041 -0.324106 -0.551578 -0.535137 -0.495679 0.633765 -0.803435 -0.606400 -0.528158 -0.787688 0.037129 -0.179705 -0.609494 0.165308 -0.355585 -0.734173 0.300062 0.258017 0.286197 0.215916 0.256843 0.210136 0.245351 0.276375 0.211305 0.213363 0.224114 0.228295 0.265999 0.230571 0.230279 0.251598 0.247411 0.187608 0.223696 0.234889 0.241916 0.231111 0.339892 0.255357 0.347133 0.250627 0.231115 0.216746 0.258089 0.205751 0.366471
chargesum: 0.00000
title: Mulliken charges with hydrogens summed into heavy atoms:
elementType: F O O O O O C C C C C C C C C C C C C C C C C C C C C C
charge: -0.232377 -0.120952 -0.091982 -0.231430 -0.235671 -0.079866 0.309058 0.150085 0.042084 0.319051 0.106499 0.150823 -0.038927 -0.067263 -0.096091 -0.047457 -0.058202 0.633765 -0.078570 -0.124523 -0.093139 -0.087187 0.037129 0.051406 -0.354137 0.165308 0.126157 -0.053588
polarizability: 3.19859471e+02 -8.09178459e+00 2.28594967e+02 -1.16495114e+01 -1.23765599e-01 1.91501053e+02
1716.lowfreq: -12.8449 -10.7300 -0.0007 0.0002 0.0004 4.3129 26.9434 41.4720 46.8284
frequency: 26.5152 41.2688 46.6835 51.5154 81.6099 88.3049 111.8381 121.3573 133.6725 140.4088 150.7212 167.1182 182.7599 191.2236 205.7837 213.5264 224.7864 228.8147 238.1689 242.1111 250.5809 259.6973 266.6450 275.1191 281.7728 292.6769 302.0567 327.3910 329.5345 335.6894 342.9347 360.5513 381.0101 386.8139 389.5986 390.0091 400.4247 418.7001 447.8191 460.9976 469.1170 479.7368 515.7520 534.5233 543.4150 548.8556 585.8012 597.8182 620.2831 632.4641 664.8460 682.8854 711.4121 737.0367 742.1655 756.1526 789.8088 795.9458 799.3530 844.4214 847.6888 859.9852 873.9819 897.7415 901.0120 911.9775 924.5710 931.1982 935.8053 944.5077 962.7730 970.0543 987.3963 998.1590 1001.7280 1010.4856 1013.4190 1025.1702 1026.3238 1053.9239 1061.2366 1076.6087 1090.6494 1099.4038 1105.0417 1118.5235 1127.1111 1131.4042 1147.1102 1153.3344 1167.1012 1169.1577 1177.1023 1187.5817 1196.4055 1198.9323 1208.0012 1208.7523 1217.3630 1223.1096 1233.6228 1240.2688 1246.5313 1259.7992 1273.8088 1277.0414 1287.0995 1297.8674 1303.3925 1306.3655 1308.6763 1319.7033 1326.1210 1339.5559 1341.5366 1347.5858 1351.8138 1361.4171 1362.6229 1381.0675 1385.1987 1386.5709 1392.7744 1410.0946 1431.5241 1439.2693 1451.1599 1456.9897 1461.1855 1463.2292 1468.8544 1474.4932 1480.6892 1485.6745 1488.6683 1491.2444 1498.6997 1572.9247 1593.0532 1630.7074 2946.2020 2955.1827 2976.3705 2981.9882 2984.8219 2986.2669 2992.8515 2995.4684 2997.9245 3002.2125 3003.9523 3004.2907 3008.9769 3010.8669 3012.1625 3030.7840 3040.3335 3052.9086 3059.9632 3072.8385 3075.7232 3077.7046 3086.1797 3100.0073 3102.1831 3103.4675 3118.9688 3120.2525 3417.6341 3560.0120 3566.0864
redmass: 6.6632 4.2021 5.7949 6.6311 4.2521 3.0210 2.3910 2.1532 4.1618 4.0808 2.3577 2.1627 1.2297 2.9227 3.9696 2.6815 2.7643 3.9293 3.2065 2.8038 2.8740 1.6207 1.7208 1.3528 1.9688 2.5620 3.3409 4.8284 3.9192 2.7631 3.2032 2.7454 2.6198 3.1298 3.7759 3.6061 1.5619 3.0366 2.6888 2.6623 3.5401 2.7737 4.0914 3.8360 3.8722 4.3637 3.0806 3.9387 4.4161 3.3916 3.3113 3.1684 3.2520 2.7830 4.8466 3.7659 2.2041 2.2415 2.5792 2.4712 2.4545 2.3787 2.7796 1.9925 2.4826 2.2034 1.8795 1.9764 2.1306 1.9303 2.2156 2.2797 2.2493 2.6231 2.0154 1.7869 2.6181 2.2158 2.3316 2.6324 2.9985 2.6231 2.1216 2.0928 3.3542 2.6804 1.6615 2.1527 2.3281 2.3176 1.3977 1.9213 1.7155 1.5266 1.3524 1.7626 2.1816 1.6537 1.3579 1.8303 1.5644 1.9247 1.4500 1.6361 1.3893 1.5306 1.5431 1.5005 1.5273 1.5534 1.3334 1.7146 1.6193 1.7275 1.5778 1.3663 1.3578 1.3679 1.3918 1.3436 1.2999 1.2097 1.2016 1.1848 1.0807 1.0788 1.0813 1.0793 1.0644 1.0668 1.0485 1.0743 1.0607 1.0746 1.0719 1.0647 1.0606 9.7930 8.1100 8.1021 1.0801 1.0634 1.0584 1.0628 1.0364 1.0725 1.0641 1.0682 1.0707 1.0537 1.0429 1.0505 1.0810 1.0962 1.0758 1.0978 1.0956 1.1013 1.0982 1.0994 1.1001 1.1003 1.0973 1.0993 1.0989 1.0985 1.0913 1.0975 1.0641 1.0663 1.0667
irintensity: 2.6972 2.2393 0.4516 1.9285 2.4368 2.4804 3.3473 2.0996 7.3850 3.0515 5.1388 9.4914 2.2763 4.2992 1.0972 25.7290 51.8346 2.5525 7.8918 1.6067 2.1947 6.2577 2.8035 136.8273 0.4282 26.8562 1.3340 12.4670 40.8476 8.8043 2.1113 7.3831 7.5148 11.1190 7.7591 8.3650 56.4811 22.1703 5.5047 39.6327 3.3383 11.5364 1.8260 1.7619 11.8853 4.4810 1.7707 10.4862 0.9334 3.2646 4.7863 0.5740 3.9749 2.4930 7.5150 6.1386 3.1410 5.1480 5.7290 22.9367 16.0552 1.4733 1.4215 42.6181 79.3598 6.1592 2.6960 5.1510 18.3474 5.9779 6.9402 24.7774 39.8629 16.6052 8.3896 13.3907 27.1019 25.0037 41.2685 5.2585 30.0000 23.0895 10.6156 7.6169 16.4346 0.9512 16.1672 8.8945 12.5567 0.5120 12.2080 4.7418 12.5654 2.3317 34.8991 11.1373 2.5583 12.6422 13.6403 2.8666 3.8551 82.6681 143.8007 10.8285 21.6181 15.2212 11.2779 13.5788 0.2598 0.6436 5.1639 17.0680 8.5286 3.0804 4.5255 2.5083 1.1744 5.4083 1.5863 77.6602 0.6634 26.2258 27.4883 30.4672 20.5719 15.5979 6.3364 8.0714 2.0879 15.4762 12.4010 14.4497 11.0348 11.1552 7.8232 4.2285 15.9594 185.7527 71.3451 145.7880 18.8248 50.5865 32.3286 12.4274 36.8163 7.1767 29.5952 12.7619 17.8195 15.1621 31.2451 16.8998 24.7905 25.7755 23.8206 16.3169 29.6773 22.0594 21.5573 5.2373 34.4196 28.5029 20.8242 24.7167 16.2149 15.6703 9.4891 12.0261 22.3355 6.4717 3.3800
temp: 298.150 k
press: 1.00000 atm
elementType: 9 8 8 8 8 8 6 6 6 6 6 6 6 6 6 6 6 6 6 6 6 6 6 6 6 6 6 6 1 1 1 1 1 1 1 1 1 1 1 1 1 1 1 1 1 1 1 1 1 1 1 1 1 1 1 1 1 1 1
symmnumber: 1
zpe: 1292297.8 jmol-1
zpe.correction: 0.492210 hartree
zpe.thermalcorrener: 0.520216 hartree
zpe.thermalcorrenthalpy: 0.521160 hartree
zpe.thermalcorrgfe: 0.436605 hartree
zpe.sumelectzpe: -1330.711740 hartree
zpe.sumelectthermal: -1330.683734 hartree
zpe.sumelectthermalent: -1330.682790 hartree
zpe.sumelectthermalfe: -1330.767345 hartree
dipole: -1.1926 2.6289 1.0604
dipole: 3.0754
quadrupole: -227.1562 -160.0426 -167.1426
quadrupole: -20.2175 18.2368 -4.8743
quadrupole: -42.3757 24.7379 17.6378 -20.2175 18.2368 -4.8743
hfenergy: -1331.2039501 hartree
pointgroup: C01 [X(C22H31F1O5)]
dipole: -0.4800579 -1.0305731 -0.4140423 debye
polarizability: 320.1042748|7.3239318|228.4639959|10.9941931|-0.2859237|191.3872206 unknown
InChI: InChI=1S/C22H31FO5/c1-12-9-19(2)13(8-16(12)25)4-5-15-14-6-7-21(28,18(27)11-24)20(14,3)10-17(26)22(15,19)23/h8,12,14-15,17,24,26,28H,4-7,9-11H2,1-3H3
charge 0 multiplicity 1
59 atoms
F  0.874761 -0.07751 1.445336
O  -3.195757 -0.17111 1.974154
O  0.016335 1.851097 -1.614313
O  -5.487535 0.163462 -0.785209
O  6.437452 0.023568 0.743605
O  -6.095836 2.481487 0.396181
C  -2.16668 0.024821 -0.253273
C  -1.303219 -1.246172 0.059834
C  0.083764 -1.178029 -0.613834
C  0.835308 0.059976 -0.059223
C  2.347782 0.086815 -0.477309
C  -3.486257 -0.382243 0.535141
C  -1.431214 1.271353 0.291354
C  0.030231 1.388114 -0.207427
C  -2.253036 -2.424244 -0.257145
C  -3.657196 -1.897053 0.19199
C  0.931042 -2.488008 -0.494478
C  3.01985 -1.137531 0.176327
C  -2.505646 0.188386 -1.759551
C  2.161997 -2.3646 0.435943
C  3.048071 1.381716 0.028962
C  2.513879 -0.053988 -2.028172
C  -4.708377 0.464456 0.165212
C  4.587326 1.372908 -0.138548
C  4.343927 -1.11187 0.524922
C  5.212145 0.074048 0.411481
C  -4.987049 1.742333 0.959293
C  5.24438 2.622388 0.487324
H  -1.139371 -1.240269 1.155344
H  -0.072362 -0.967945 -1.690059
H  -1.416122 1.22048 1.394129
H  -1.940695 2.207251 -0.006398
H  0.533412 2.144864 0.425462
H  -1.973552 -3.34492 0.283656
H  -2.251173 -2.663199 -1.336871
H  -4.412173 -2.00925 -0.604321
H  -4.036847 -2.446366 1.075447
H  1.271825 -2.800629 -1.499432
H  0.291126 -3.307742 -0.122296
H  -3.121984 1.090663 -1.920054
H  -1.590707 0.332221 -2.353518
H  -3.070622 -0.668809 -2.163265
H  2.781034 -3.279038 0.37441
H  1.807029 -2.29189 1.483261
H  2.809279 1.513462 1.102225
H  2.650061 2.268581 -0.507203
H  2.000443 0.760408 -2.565505
H  3.584122 -0.035525 -2.292684
H  2.105243 -1.00638 -2.402558
H  4.830564 1.376013 -1.223921
H  -3.756245 -0.790654 2.506293
H  4.82412 -2.00436 0.94742
H  0.800695 2.435196 -1.766363
H  -4.073166 2.369635 0.974449
H  -5.199062 1.472202 2.013555
H  4.986805 2.706553 1.559196
H  6.341958 2.554356 0.411243
H  4.90618 3.542577 -0.023602
H  -6.450562 1.937145 -0.363922
