program: Gaussian 09
title: 000101555
version: EM64L-G09RevD.01
frameworkgroup: C1[X(C21H25NO2)]
method: RPBEPBE
basis: SDD
operation: Freq
keyword: #p
keyword: freq=noraman
keyword: PBEPBE/SDD
title: #p freq=noraman PBEPBE/SDD
converged: YES YES NO NO
title: Mulliken charges:
elementType: O O N C C C C C C C C C C C C C C C C C C C C C H H H H H H H H H H H H H H H H H H H H H H H H H
charge: -0.293726 -0.253299 -0.033616 -0.603997 -0.097536 0.528012 -0.232401 0.545765 -0.391886 -0.458644 -0.467032 -0.411962 -0.723480 -0.226114 -0.693162 -0.694624 0.193788 0.094709 -0.373850 -0.310652 -0.212340 -0.249781 0.157392 -0.501153 0.216778 0.203277 0.249643 0.208208 0.228757 0.228222 0.229803 0.227310 0.206323 0.272018 0.214336 0.228712 0.209547 0.211364 0.227616 0.228760 0.212035 0.208967 0.256964 0.272575 0.229146 0.230795 0.237539 0.241178 0.229715
chargesum: 0.00000
title: Mulliken charges with hydrogens summed into heavy atoms:
elementType: O O N C C C C C C C C C C C C C C C C C C C C C
charge: -0.293726 -0.253299 -0.033616 -0.183941 0.152107 0.528012 -0.024192 0.545765 -0.163129 -0.230422 -0.237229 -0.184652 -0.030804 0.002598 -0.044636 -0.044862 0.193788 0.094709 -0.116885 -0.038077 0.016805 -0.018985 0.157392 0.207279
polarizability: 2.94389089e+02 -2.03214582e+01 2.78022916e+02 1.71824057e+00 -1.08888093e+01 1.66842832e+02
1716.lowfreq: -21.8115 -5.8738 -5.7311 0.0004 0.0007 0.0007 2.7397 10.3754 14.9653
frequency: -20.6055 9.7830 14.8598 38.4557 40.9737 46.5814 66.4083 73.3587 79.0725 99.7562 113.9762 127.2640 147.5879 179.8696 181.5712 201.5052 213.4318 216.4390 236.3479 249.5071 256.8345 290.2407 291.2353 320.2488 339.3017 344.1050 360.7239 393.3666 404.9280 406.6090 434.7014 458.2238 479.1101 534.0902 539.0312 545.3624 576.1793 598.9853 637.3768 649.5935 678.8061 701.5763 748.4966 752.6928 761.9336 777.8733 804.7683 810.2922 836.2911 848.7044 862.6324 876.9962 889.8923 901.5286 916.6623 923.2510 937.5405 953.5587 954.8542 962.3939 965.2261 971.1328 989.2925 1011.7278 1037.6926 1042.9544 1047.0513 1063.0574 1070.1403 1111.7280 1113.5228 1117.7271 1122.6750 1139.6528 1144.7334 1155.6893 1172.8381 1191.1283 1193.8905 1208.7219 1216.4057 1222.5464 1235.2356 1270.9955 1277.4837 1293.1641 1303.0599 1308.7644 1312.2806 1338.8405 1367.9634 1376.4794 1378.7774 1383.2942 1387.3463 1395.5112 1413.3259 1422.0513 1430.4621 1450.9732 1464.3731 1465.3475 1466.4412 1468.2448 1468.9406 1474.0647 1479.3325 1483.9928 1484.4512 1506.9099 1563.1401 1581.6083 1595.6015 1620.6484 1622.9223 1696.8408 2935.7826 2972.5773 2973.9356 2975.6524 2976.6293 2979.7185 2999.8862 3018.5153 3036.4603 3065.0835 3068.9925 3072.5067 3076.5566 3081.0742 3094.7665 3099.5412 3105.4401 3106.7902 3128.1652 3129.5392 3134.6522 3142.5109 3147.7245 3160.0489 3180.1865
redmass: 2.7774 4.7322 4.8135 4.1559 4.7654 5.3932 3.8699 4.0690 3.3315 1.9444 1.5705 3.1946 3.7976 3.3652 3.1141 2.8257 1.1012 1.1342 3.1164 1.1578 3.4258 3.4679 4.6478 3.6440 3.7043 2.6587 2.9598 2.7946 2.9662 4.3830 3.8288 3.2497 4.5123 3.0365 3.5041 4.2928 2.9783 4.9355 6.7644 6.3274 4.7713 3.0483 3.5401 4.0487 2.5790 2.0045 4.4448 3.1943 2.0749 1.2565 1.7731 1.5310 2.5438 1.5631 1.1830 7.0652 1.6072 1.5313 1.4356 1.6957 1.3779 1.3828 1.3283 2.9981 3.8126 2.9511 1.6313 2.9341 1.5832 2.5517 1.2659 1.5881 1.8899 1.7254 1.4548 1.7370 1.0614 1.1739 1.7264 1.8941 2.5821 1.8304 3.5828 1.5122 1.3221 1.6110 1.4286 1.3200 1.4793 1.4077 2.0098 1.1964 2.6071 4.0715 1.3033 1.2439 2.4033 1.2764 2.1080 1.0505 1.0880 1.0583 1.0457 1.0814 1.7144 1.2181 1.0481 1.1084 1.0997 2.3982 7.0615 6.4079 6.8128 8.6219 6.4557 9.8735 1.0872 1.0349 1.0467 1.0356 1.0485 1.0842 1.0297 1.0890 1.0979 1.1000 1.0988 1.0991 1.1005 1.0997 1.1004 1.1041 1.0867 1.0868 1.0957 1.0860 1.0967 1.1044 1.0909 1.0964 1.0971
irintensity: 0.0115 0.0620 0.0374 0.7299 1.1798 1.6687 0.8617 0.1168 0.9955 3.6367 0.4560 2.2248 2.2267 2.4843 0.9753 1.6838 0.6326 0.1323 0.8925 0.1378 0.5551 0.9390 11.0159 9.3633 8.4520 2.0363 4.5835 5.0342 0.3495 1.4288 0.5190 0.5764 0.8317 11.2698 8.7272 0.9088 10.8788 22.1683 0.0199 7.3649 19.1262 2.1167 0.2831 11.0791 44.4731 21.8086 62.3537 9.9365 13.9163 0.1255 45.5274 6.7811 1.3225 3.7691 3.3462 3.0110 22.1175 8.0684 0.3186 12.5245 1.9212 0.1329 0.2864 7.0595 95.8156 162.8797 16.4348 7.6647 3.3826 1.7189 0.1287 22.9496 32.2430 2.8491 68.2662 0.4338 7.7108 3.4318 35.7122 1.6170 0.0579 3.0183 286.5583 30.9654 0.4923 6.5024 4.5418 0.8417 3.8022 3.0652 0.7254 14.8034 5.1998 2.6461 12.9769 8.5997 5.6588 21.8973 6.1857 13.8069 6.2858 22.6702 2.0746 0.3158 56.5810 21.5136 17.6528 6.4247 4.3095 37.4374 55.0900 0.0569 6.6483 178.3449 0.2826 231.1809 42.6427 30.6117 1.0447 46.6429 72.0600 17.3776 47.3562 7.8465 15.9619 0.7452 46.3669 110.8278 26.1286 40.3164 15.0296 29.0449 2.8301 30.7962 45.9363 3.0492 0.5280 19.1884 11.1954 16.8081 11.3886
temp: 298.150 k
press: 1.00000 atm
elementType: 8 8 7 6 6 6 6 6 6 6 6 6 6 6 6 6 6 6 6 6 6 6 6 6 1 1 1 1 1 1 1 1 1 1 1 1 1 1 1 1 1 1 1 1 1 1 1 1 1
symmnumber: 1
zpe: 1063832.3 jmol-1
zpe.correction: 0.405192 hartree
zpe.thermalcorrener: 0.429279 hartree
zpe.thermalcorrenthalpy: 0.430224 hartree
zpe.thermalcorrgfe: 0.348358 hartree
zpe.sumelectzpe: -1018.663856 hartree
zpe.sumelectthermal: -1018.639769 hartree
zpe.sumelectthermalent: -1018.638825 hartree
zpe.sumelectthermalfe: -1018.720691 hartree
dipole: -0.6001 0.3879 -1.0201
dipole: 1.2454
quadrupole: -127.3292 -133.6490 -140.5072
quadrupole: -3.4068 -2.0128 -2.7495
quadrupole: 6.4993 0.1795 -6.6787 -3.4068 -2.0128 -2.7495
hfenergy: -1019.0690484 hartree
pointgroup: C01 [X(C21H25N1O2)]
dipole: -0.2165908 0.2138126 -0.3840171 debye
polarizability: 291.5478349|-21.2658016|281.8640872|1.3117585|1.9852522|165.8429153 unknown
InChI: InChI=1S/C21H25NO2/c1-15(2)18-11-9-17(10-12-18)13-16(3)14-22-20-8-6-5-7-19(20)21(23)24-4/h5-12,14-16H,13H2,1-4H3
charge 0 multiplicity 1
49 atoms
O  5.471397 -0.000043 0.636747
O  3.841684 -1.578107 0.115383
N  1.230801 -0.598151 0.244877
C  -1.383272 -2.774102 -1.0423
C  0.007141 -2.641509 -0.346286
C  -2.385688 -1.718513 -0.595527
C  -5.19462 1.394065 0.771347
C  -4.221301 0.313975 0.290935
C  -2.982356 -1.781315 0.688877
C  -2.727603 -0.623888 -1.430532
C  -3.882761 -0.78363 1.122438
C  -3.627303 0.373998 -0.996491
C  0.970259 -3.777566 -0.790139
C  0.65593 -1.313893 -0.666608
C  -6.46027 1.467042 -0.124313
C  -4.505555 2.782355 0.862456
C  1.852002 0.647493 0.040191
C  3.274313 0.812124 0.143997
C  1.036292 1.802773 -0.139029
C  3.828876 2.119997 0.082064
C  1.609988 3.085398 -0.211189
C  3.012794 3.251931 -0.095341
C  4.159003 -0.372892 0.283979
C  6.425662 -1.120971 0.77262
H  -1.768953 -3.789467 -0.824889
H  -1.237898 -2.718112 -2.139717
H  -0.122181 -2.689904 0.75086
H  -5.52269 1.115747 1.793412
H  -2.741487 -2.619107 1.355778
H  -2.288102 -0.556608 -2.434151
H  -4.331396 -0.856131 2.121402
H  -3.870901 1.2048 -1.670365
H  1.125054 -3.763262 -1.88605
H  1.953949 -3.659025 -0.304631
H  0.549693 -4.763781 -0.519503
H  0.674191 -1.022057 -1.740103
H  -6.197659 1.752811 -1.160042
H  -7.169076 2.221906 0.264396
H  -6.977887 0.491799 -0.164558
H  -3.625079 2.748272 1.529091
H  -5.209061 3.541274 1.252992
H  -4.163683 3.120092 -0.133869
H  -0.049464 1.668565 -0.195635
H  4.91389 2.221861 0.167855
H  0.962727 3.958085 -0.35511
H  3.458449 4.250517 -0.146019
H  6.511185 -1.673992 -0.178566
H  6.092078 -1.816124 1.561634
H  7.379888 -0.646033 1.041933
