program: Gaussian 09
title: 000101512
version: EM64L-G09RevD.01
frameworkgroup: C1[X(C10H6N10)]
method: RPBEPBE
basis: SDD
operation: Freq
keyword: #pfreq=noraman
keyword: PBEPBE/SDD
title: #p freq=noraman PBEPBE/SDD
converged: NO YES NO NO
title: Mulliken charges:
elementType: N N N N N N N N N N C C C C C C C C C C H H H H H H
charge: -0.377707 -0.377753 -0.022483 -0.022509 -0.052502 -0.052403 0.054477 0.054348 0.028408 0.028436 0.138806 0.138895 -0.074207 -0.074187 -0.006324 -0.006313 -0.198230 -0.198181 -0.370605 -0.370592 0.352325 0.352338 0.273823 0.273830 0.254155 0.254157
chargesum: 0.00000
title: Mulliken charges with hydrogens summed into heavy atoms:
elementType: N N N N N N N N N N C C C C C C C C C C
charge: -0.025382 -0.025415 -0.022483 -0.022509 -0.052502 -0.052403 0.054477 0.054348 0.028408 0.028436 0.138806 0.138895 -0.074207 -0.074187 -0.006324 -0.006313 0.075593 0.075649 -0.116450 -0.116435
polarizability: 3.77645664e+02 -5.80608446e+00 2.05968441e+02 -3.40674844e-02 -2.54988228e-02 6.83276354e+01
1716.lowfreq: -6.3094 -0.0010 -0.0006 0.0003 0.4978 2.2181 13.7362 45.8503 47.9395
frequency: 13.7353 45.8503 47.9395 58.9176 142.9235 166.6638 201.8908 203.8840 217.3407 220.4330 274.2862 325.3012 348.6580 485.1678 512.2695 529.6428 541.1837 544.5516 568.9390 599.8831 606.6032 619.9575 651.9132 652.4494 694.4863 694.7339 698.7269 705.4779 800.1976 804.1873 811.2844 825.9610 856.8779 857.4137 888.0630 901.6969 903.3329 928.6968 929.4149 953.4079 1022.0760 1054.0859 1057.2169 1129.3264 1140.5308 1184.9346 1191.9956 1231.3463 1244.6768 1250.5404 1269.7707 1296.3772 1296.5735 1324.3063 1325.0279 1354.4946 1356.3859 1377.1047 1400.5588 1408.8770 1431.7697 1432.8185 1496.1596 1498.0395 1602.5606 1602.8663 3173.6543 3173.7960 3239.7050 3239.7338 3576.7605 3576.9004
redmass: 6.4762 7.4272 9.4893 10.6431 6.7073 10.9699 9.8573 5.4500 5.6465 7.8037 6.2531 8.4975 7.4811 6.6188 12.0115 4.8129 9.0284 11.6133 3.7290 4.3768 4.1492 9.1229 6.1331 8.4212 2.0693 7.3384 1.1413 2.1552 10.6056 7.0573 6.4440 9.9589 1.5494 1.5857 9.3856 8.1339 8.2314 1.4339 1.4381 7.2715 4.0072 2.0319 2.4962 5.7663 5.0457 3.7194 2.9450 4.8048 4.2384 4.1386 4.4789 3.5770 3.5734 2.8390 2.8133 3.7161 4.0101 4.1167 1.4881 1.9887 3.6640 3.5467 9.1260 9.4052 9.0109 8.9412 1.0922 1.0923 1.0995 1.0995 1.0827 1.0827
irintensity: 3.6043 3.8684 7.9486 0.0028 0.0005 0.0023 0.0172 24.6541 0.0009 1.0601 0.0004 3.2942 50.7563 0.0000 21.9046 0.0019 0.6259 0.0000 0.9966 0.0014 34.7704 2.4545 0.0008 0.0007 129.1305 34.4971 0.0023 100.4664 0.0001 0.0001 0.0161 16.2092 0.0778 29.0004 0.0001 27.0469 0.0069 0.0018 29.5598 0.0002 0.7950 0.0096 58.9554 59.6723 0.0009 0.0717 297.7347 0.0138 0.0080 95.0984 4.6345 35.5311 35.2313 410.2105 0.0604 0.0365 81.2365 0.0009 7.4391 0.0001 142.3093 0.0723 78.8781 0.0586 0.3230 0.7700 32.7461 0.0879 0.3625 0.2944 18.2187 101.7424
temp: 298.150 k
press: 1.00000 atm
elementType: 7 7 7 7 7 7 7 7 7 7 6 6 6 6 6 6 6 6 6 6 1 1 1 1 1 1
symmnumber: 1
zpe: 453356.7 jmol-1
zpe.correction: 0.172674 hartree
zpe.thermalcorrener: 0.187050 hartree
zpe.thermalcorrenthalpy: 0.187994 hartree
zpe.thermalcorrgfe: 0.128402 hartree
zpe.sumelectzpe: -930.748377 hartree
zpe.sumelectthermal: -930.734002 hartree
zpe.sumelectthermalent: -930.733058 hartree
zpe.sumelectthermalfe: -930.792650 hartree
dipole: 0.0016 0.0001 0.0223
dipole: 0.0223
quadrupole: -158.8879 -92.6939 -113.2418
quadrupole: -32.4072 0.0281 -0.0053
quadrupole: -37.2800 28.9140 8.3661 -32.4072 0.0281 -0.0053
hfenergy: -930.9210518 hartree
pointgroup: C01 [X(C10H6N10)]
dipole: 0.0006074 0.000075 0.0087714 debye
dipolederiv: -0.83498 -0.0992572 -0.0000435 0.5772468 -0.5446501 -0.0001251 -0.0002836 -0.0014645 -0.2161777 -0.8355967 -0.0991562 -0.0003373 0.5781883 -0.5448515 0.0027723 -0.0057095 0.000953 -0.2162624 -0.3303336 0.1085371 -0.0003489 -0.1804594 -0.6690911 0.0005152 0.0011611 0.0004651 -0.2752663 -0.3302712 0.1085614 -0.001024 -0.1809124 -0.6692274 0.0027544 0.0018067 0.0032216 -0.2753433 0.0845381 0.0054604 -0.0007258 0.5129746 -0.0486032 0.0000072 -0.0081982 -0.0005434 -0.1117517 0.0856751 0.0056455 0.0004617 0.5131324 -0.0487648 -0.000351 0.0009323 0.0003446 -0.1117418 -0.0485513 0.1024763 0.0002499 -0.6897795 -0.4543945 0.0000432 0.0019252 0.0005985 -0.1906472 -0.0480893 0.1027617 -0.0006532 -0.6898018 -0.4547528 0.0014155 0.0059544 0.0025874 -0.1906324 -0.3147194 -0.1127267 0.0008749 0.2451234 -0.571543 0.0008801 -0.0035882 0.0012565 -0.165784 -0.3144589 -0.1125213 0.0010383 0.2453082 -0.5708754 0.003919 -0.0030963 0.0036124 -0.1658121 -0.7983501 0.2097459 0.0001112 -0.9390986 0.3369258 -0.0001635 0.005742 0.0002488 0.1283421 -0.7976218 0.20946 -0.0028724 -0.9400122 0.3372034 -0.0021717 0.0070227 -0.0007315 0.1284012 0.8894747 -0.5188934 0.0008111 0.3576778 0.4106655 -0.0003216 -0.0040565 0.000541 0.1038232 0.8891497 -0.5188326 0.0051849 0.357697 0.4108847 -0.0021878 -0.0026333 -0.0031243 0.1039093 0.3694662 0.0430988 0.0002392 -0.4177291 0.3457013 0.0003417 0.006424 -0.0009175 0.1124567 0.3678733 0.0433472 -0.0000373 -0.4177755 0.345159 -0.002467 0.0035496 -0.0025015 0.1124497 1.0358026 0.2025661 -0.0006221 0.3757996 0.3494171 -0.0006173 -0.0021627 -0.0000031 -0.0061763 1.0367582 0.202546 0.0001185 0.3758963 0.3495763 -0.0019646 -0.0015346 -0.0016433 -0.0060638 -0.4092001 0.0359749 -0.0014974 0.222667 0.6214231 -0.0011781 -0.0019348 -0.0022022 -0.0411328 -0.409724 0.035363 -0.0009108 0.2224249 0.6213362 -0.0054983 -0.0035654 -0.0061454 -0.0411093 0.1746804 0.0095262 0.0004133 -0.0494723 0.2683118 0.000216 0.0001687 0.0010641 0.3552336 0.1746398 0.0094968 -0.0003554 -0.0494583 0.2683668 0.0006882 0.0001848 0.0011742 0.3552438 0.1128779 0.0193553 0.0000393 0.0264949 0.0263963 0.000291 -0.0000053 -0.0000034 0.1749978 0.1128816 0.0193565 -0.0002797 0.0265155 0.0264148 0.001184 -0.000159 0.0008992 0.1749745 0.069034 -0.0059141 0.0001355 -0.0413339 -0.0705257 0.0003461 0.0012017 0.0005553 0.1320388 0.0690449 -0.0059778 0.0000299 -0.0413137 -0.0705026 0.0016722 0.0008544 0.0017585 0.1320305 unknown
polarizability: 377.6143077|-6.2511346|205.9959736|0.1518966|-0.7220404|68.3314596 unknown
InChI: InChI=1S/C10H6N10/c1-11-5-7(13-1)15-3-17-9(5)19-20-10-6-8(14-2-12-6)16-4-18-10/h1-4,11-12H
charge 0 multiplicity 1
26 atoms
N  -3.241191 1.716597 -0.00501
N  3.240944 -1.716722 0.015228
N  -5.269424 0.63338 -0.000184
N  5.269194 -0.633477 0.010225
N  -0.548545 0.351675 -0.008612
N  0.548331 -0.35189 0.001939
N  -4.320364 -1.66969 0.003659
N  4.320123 1.669508 -0.010338
N  -1.856812 -1.766994 -0.000326
N  1.856437 1.766703 -0.014381
C  -2.947281 0.363744 -0.003308
C  2.947003 -0.363911 0.004971
C  -4.223388 -0.312901 0.000466
C  4.223112 0.312845 0.000997
C  -1.761017 -0.403088 -0.002985
C  1.760749 0.402619 -0.003173
C  -4.642601 1.820277 -0.00403
C  4.642374 -1.82032 0.018835
C  -3.110619 -2.317784 0.002468
C  3.110016 2.317514 -0.017192
H  -2.551759 2.469343 -0.010463
H  2.551342 -2.469315 0.021767
H  -5.148662 2.783626 -0.004885
H  5.148469 -2.783623 0.02666
H  -3.154831 -3.41054 0.005026
H  3.154499 3.410224 -0.026653
