program: Gaussian 09
title: 000101504
version: EM64L-G09RevD.01
frameworkgroup: C1[X(C7H10N4O2)]
method: RPBEPBE
basis: SDD
operation: Freq
keyword: #p
keyword: freq=noraman
keyword: PBEPBE/SDD
title: #p freq=noraman PBEPBE/SDD
converged: YES YES NO NO
title: Mulliken charges:
elementType: O O N N N N C C C C C C C H H H H H H H H H H
charge: -0.326544 -0.345355 -0.380107 -0.136616 -0.373267 -0.364834 0.170024 -0.010569 0.155714 0.230886 -0.218936 -0.618079 -0.614788 0.355766 0.270178 0.388630 0.351172 0.268285 0.230271 0.230938 0.232112 0.231595 0.273524
chargesum: 0.00000
title: Mulliken charges with hydrogens summed into heavy atoms:
elementType: O O N N N N C C C C C C C
charge: -0.326544 -0.345355 -0.024341 -0.136616 0.015363 -0.013662 0.170024 -0.010569 0.155714 0.230886 0.051242 0.111415 0.122444
polarizability: 1.49959139e+02 -1.70171977e+00 1.34499644e+02 8.58708976e-02 -8.00458002e-02 5.54221517e+01
1716.lowfreq: -3.7235 -0.0008 -0.0006 0.0008 2.8545 7.7045 63.6872 73.2609 87.1787
frequency: 63.6635 73.2593 87.1749 100.9291 133.9533 134.6895 160.9774 180.5737 225.7287 275.9188 294.1580 322.0599 356.7266 363.4476 472.9398 575.8390 602.4450 641.4203 718.8323 749.4023 764.1512 771.7616 799.9914 803.8568 822.3485 927.5822 945.9448 967.8442 1026.7847 1073.1962 1118.0529 1121.3883 1125.2714 1147.8772 1152.9946 1187.9161 1208.0194 1272.7396 1311.1426 1343.3111 1386.3596 1416.0592 1420.5476 1447.3004 1467.1099 1471.3897 1483.4475 1484.3158 1520.3384 1562.7015 1581.4832 1598.6697 1630.1793 2979.1716 2981.2632 3057.8051 3059.6393 3079.9169 3110.1723 3112.2774 3248.8201 3480.7579 3523.8209
redmass: 2.5406 1.2985 3.2299 1.1808 3.5576 3.7108 5.6825 4.1246 5.6709 5.3289 4.9015 6.1391 5.5993 5.1009 7.4779 7.2960 6.5762 4.9450 5.6009 1.2091 4.3402 4.3530 1.2899 3.8833 1.4516 7.5603 1.0570 4.5445 4.8581 1.7341 1.3124 1.3000 2.6060 1.6819 1.8696 2.5321 2.5956 3.4997 2.9225 3.7096 4.7012 1.1984 1.2215 2.9530 1.2168 1.0649 1.0454 1.0449 2.3486 2.7002 4.9761 5.9341 1.9852 1.0349 1.0350 1.1014 1.1019 1.0935 1.0976 1.0987 1.0994 1.0779 1.0819
irintensity: 1.0225 0.1511 7.4692 2.9140 6.2231 7.2014 1.0926 12.8642 4.2228 1.6224 20.3674 19.8832 1.0217 28.2340 6.5519 5.4650 2.8154 18.8525 0.3715 111.8527 2.3011 0.9587 126.7800 1.3246 6.7071 12.8847 128.4862 23.1573 6.6199 35.0345 0.9135 0.1251 36.5643 33.4528 59.7481 26.7322 3.5317 0.8337 14.5835 94.2611 12.2542 24.7455 41.9602 20.4172 103.7523 16.3101 19.8887 12.4306 64.3554 472.3443 152.4849 198.6680 2.0401 86.9108 72.5813 31.2908 35.2570 573.7127 6.6919 3.1539 1.4195 60.3937 115.1959
temp: 298.150 k
press: 1.00000 atm
elementType: 8 8 7 7 7 7 6 6 6 6 6 6 6 1 1 1 1 1 1 1 1 1 1
symmnumber: 1
zpe: 469712.9 jmol-1
zpe.correction: 0.178904 hartree
zpe.thermalcorrener: 0.191635 hartree
zpe.thermalcorrenthalpy: 0.192579 hartree
zpe.thermalcorrgfe: 0.139179 hartree
zpe.sumelectzpe: -641.280289 hartree
zpe.sumelectthermal: -641.267559 hartree
zpe.sumelectthermalent: -641.266615 hartree
zpe.sumelectthermalfe: -641.320014 hartree
dipole: -2.6213 1.2499 -0.0022
dipole: 2.9041
quadrupole: -73.8139 -64.2577 -77.7165
quadrupole: -0.1815 0.0346 0.0062
quadrupole: -1.8845 7.6717 -5.7871 -0.1815 0.0346 0.0062
hfenergy: -641.4591934 hartree
pointgroup: C01 [X(C7H10N4O2)]
dipole: 1.0782424 -0.3756282 0.0414907 debye
dipolederiv: -0.9848951 -0.2919649 0.127392 -0.086286 -0.7657346 0.1186335 0.0647006 0.1335409 -0.4374126 -1.0712324 0.0698487 0.0260468 0.2776341 -0.8356837 0.1211113 -0.0380983 0.1363217 -0.4159021 -0.3968594 -0.1383147 0.0553838 -0.4181422 -0.3533288 0.0743374 0.1415616 0.0558034 -0.2335401 -0.4825372 -0.0253506 0.0229141 0.1595507 -0.4005408 0.0329395 -0.033824 0.0455518 -0.2710942 -0.8189315 0.0723536 0.005311 0.0250051 -0.9496245 0.157525 0.0174088 0.1603598 -0.4700018 -1.2640622 -0.1255968 0.0960756 -0.1401664 -0.452984 0.0134223 0.095212 0.0109164 -0.4534221 -0.2300995 0.3012079 -0.0741369 0.4370254 0.1057283 -0.0462419 -0.115506 -0.0371391 0.0723091 -0.0666335 -0.1745436 0.0574821 -0.3276892 -0.1737225 0.0701046 0.1039895 0.0595791 -0.0430167 1.3141811 0.1776612 -0.1262039 -0.1177178 1.2873795 -0.3184428 -0.0361345 -0.3387722 0.3160421 1.7693413 0.0820835 -0.1313911 -0.0631289 1.0091741 -0.232798 -0.0857475 -0.2428016 0.3161548 0.1448798 0.0464249 -0.0274831 0.0009412 0.1302981 -0.0572216 -0.0136164 -0.0613505 -0.0355158 0.2846837 -0.3131058 0.0879089 -0.1401907 0.2310969 0.0149876 0.0382427 0.0182714 0.2345699 0.2791044 0.1333858 -0.0438361 0.3883718 0.2366607 -0.0236473 -0.1169431 -0.0049029 0.2679598 0.3047365 -0.0370338 0.0133646 0.021575 0.3297624 0.0007397 -0.0047824 0.0040181 0.33593 0.0981996 0.0006096 0.0062201 -0.0017149 0.0113772 0.056082 0.0068792 0.0564065 0.1757675 0.7711277 0.0609369 -0.0489432 0.126999 0.2048667 0.0290033 -0.0705201 0.0329814 0.3205444 0.2646983 0.0234388 -0.0025323 0.0087812 0.2432546 0.0265023 0.0026305 0.025043 0.3235364 -0.0137492 0.0007287 0.0049457 -0.1393472 0.0912736 0.0138977 0.0464457 0.0087016 0.1224844 0.0524099 0.0816704 -0.001019 0.0708418 0.0296494 0.0779527 -0.0577931 0.1182361 -0.1286412 0.0491576 0.05877 -0.0487399 0.0797792 -0.1074798 -0.100948 0.0061697 -0.1423729 0.0020661 -0.037646 -0.0353091 0.1168847 -0.0405577 0.0513373 -0.0660097 0.1777059 -0.0172121 -0.0767502 -0.0774502 -0.0967984 -0.0804926 -0.124085 0.0630904 0.0049931 -0.1297483 -0.0452107 -0.0440644 0.1115764 0.1288977 -0.0351512 0.0025215 0.0141496 0.0330774 0.0017676 0.0240307 0.1219965 unknown
polarizability: 149.7363743|-1.7311684|127.5796144|-5.9532114|-21.9834498|62.5649457 unknown
InChI: InChI=1S/C7H10N4O2/c1-8-6(12)4-5(7(13)9-2)11-3-10-4/h3,8-10H,1-2H3
charge 0 multiplicity 1
23 atoms
O  -3.252391 -0.909739 0.533515
O  0.566032 1.590812 -0.485883
N  -0.937088 -2.316398 0.814929
N  1.253452 -1.890253 0.537426
N  -2.102562 1.037613 -0.134633
N  2.558879 0.387568 -0.253538
C  -0.870122 -0.987173 0.401912
C  0.506807 -0.734442 0.232381
C  -2.173685 -0.266164 0.267099
C  1.195325 0.506985 -0.195935
C  0.346612 -2.825106 0.88443
C  -3.30526 1.856159 -0.306474
C  3.441983 1.483081 -0.653223
H  -1.840833 -2.759082 1.009425
H  0.575405 -3.844591 1.182585
H  -1.149684 1.434492 -0.319325
H  2.932168 -0.533658 0.004113
H  -4.18853 1.233106 -0.093185
H  -3.372071 2.239394 -1.341335
H  -3.296559 2.717966 0.386616
H  4.011389 1.223323 -1.564804
H  4.156573 1.731438 0.152937
H  2.816759 2.365469 -0.862534
